program: Gaussian 09
title: 000034598
version: EM64L-G09RevD.01
frameworkgroup: C1[X(C21H28F3N3)]
method: RPBEPBE
basis: SDD
operation: Freq
keyword: #p
keyword: freq=noraman
keyword: PBEPBE/SDD
title: #p freq=noraman PBEPBE/SDD
converged: YES YES NO NO
title: Mulliken charges:
elementType: F F F N N N C C C C C C C C C C C C C C C C C C C C C H H H H H H H H H H H H H H H H H H H H H H H H H H H H
charge: -0.165621 -0.176877 -0.172480 -0.225789 -0.074843 -0.063671 0.196084 0.139371 -0.500274 -0.505443 0.067863 -0.444353 -0.410409 0.230529 -0.422907 -0.401056 -0.328771 -0.348005 -0.357538 -0.389082 -0.379602 0.152276 -0.367505 -0.409488 -0.230896 0.220811 -0.614290 0.226477 0.225457 0.229089 0.249535 0.227986 0.220809 0.207709 0.212737 0.210008 0.205654 0.234129 0.223471 0.173886 0.202646 0.206019 0.185875 0.187861 0.203174 0.208150 0.187275 0.186593 0.205850 0.240991 0.258136 0.228578 0.222475 0.188030 0.223369
chargesum: 0.00000
title: Mulliken charges with hydrogens summed into heavy atoms:
elementType: F F F N N N C C C C C C C C C C C C C C C C C C C C C
charge: -0.165621 -0.176877 -0.172480 -0.225789 -0.074843 -0.063671 0.196084 0.139371 -0.048340 -0.026820 0.067863 0.004442 0.010036 0.230529 -0.007244 0.056543 0.047762 0.043889 0.033497 0.006343 0.012841 0.152276 -0.126514 -0.151352 -0.002318 0.220811 0.019584
polarizability: 2.93800919e+02 -1.49910143e+01 2.75880377e+02 1.98047675e+01 9.48313265e+00 1.83001365e+02
1716.lowfreq: -6.1272 -0.0005 -0.0001 0.0007 0.7350 4.2518 15.1796 17.6501 20.7343
frequency: 14.5731 17.6199 20.4509 47.4202 55.1005 60.7474 85.5182 91.6173 99.8392 124.1886 129.3189 142.4418 159.9521 178.6245 214.1952 217.8729 231.2747 245.1301 259.8870 267.6716 287.9124 291.9520 308.4883 317.4060 333.5622 338.4692 346.8089 362.4066 388.1563 395.5782 426.2036 452.6071 461.2538 472.3305 479.0349 498.3668 547.4748 555.3504 580.0512 590.3231 612.0792 620.1757 626.3389 639.6851 662.1179 732.6138 743.9815 750.4626 762.8954 775.4368 787.4500 812.8824 825.1545 844.2217 848.8251 854.8914 899.3935 903.8242 908.3031 923.8977 950.5548 962.5180 967.9738 973.1136 991.1154 1005.5597 1017.2433 1031.7536 1044.1604 1050.0275 1054.4073 1070.7423 1079.5869 1084.0655 1086.7544 1096.7938 1107.6708 1120.2613 1132.4244 1137.8154 1142.7912 1151.2282 1154.7097 1159.3158 1184.9018 1189.2712 1196.1035 1208.0466 1227.6446 1241.5419 1255.3520 1270.9838 1273.5236 1279.3723 1283.0472 1284.0520 1299.2084 1302.0408 1307.8674 1315.7425 1337.6469 1340.6777 1341.7201 1350.4317 1355.5678 1368.5383 1369.0328 1372.2825 1374.6779 1396.4896 1406.0951 1426.9127 1428.6200 1451.3243 1452.7610 1455.2506 1459.2074 1461.5951 1464.8671 1465.7903 1469.2111 1472.8985 1473.8599 1475.0432 1479.0600 1480.7627 1484.4662 1495.2358 1567.9724 1575.8462 1620.3343 2819.5527 2845.0325 2848.3005 2859.6224 2862.9938 2874.3667 2948.1425 2976.1468 2979.6165 2982.8601 2992.5805 2994.0798 3003.7879 3004.8982 3018.3683 3024.3720 3026.7300 3030.5696 3043.2741 3043.6452 3047.0683 3048.1672 3054.4921 3072.1665 3076.3066 3134.7735 3156.2974 3178.4664
redmass: 3.9236 4.3887 4.1542 4.2951 6.1369 7.6511 3.5857 3.0986 2.3153 8.1698 2.5728 3.0130 5.3599 3.4551 2.3680 1.3027 4.7817 2.4973 2.0429 2.4898 3.9047 2.0248 8.1790 2.2060 2.5047 5.3466 4.5750 2.7947 3.1097 3.2135 3.4446 8.9773 3.3079 4.0781 4.2926 2.9846 4.6199 4.3120 4.1181 4.0066 2.9276 5.1896 5.3116 4.9241 3.3938 3.0310 2.1036 3.8721 1.3363 2.8052 2.2030 3.3043 1.5115 2.7293 1.5765 1.6174 1.4513 2.1149 1.6572 2.0155 3.3660 1.7439 2.7529 3.9023 6.2857 2.5565 2.8291 3.4142 2.9499 1.8585 2.2104 1.9099 1.8704 1.8924 2.0615 2.0933 1.6764 1.8423 2.1686 1.1822 2.4334 2.5260 1.8472 2.0081 1.4840 2.5118 1.0784 1.6637 1.7405 1.2859 1.2539 1.4503 1.3992 2.3504 1.5863 1.2913 1.3087 1.5518 1.3747 1.5084 1.2838 1.4227 1.5008 1.4355 1.6216 1.9778 1.8633 1.4527 1.4233 1.4703 4.8206 4.2753 1.1747 1.0809 1.0782 1.1677 1.0738 1.0767 1.3654 1.2221 1.0956 1.4198 1.3979 1.1988 1.3130 1.0542 2.0012 1.1711 6.9242 6.9535 7.3837 1.0705 1.0711 1.0635 1.0688 1.0658 1.0663 1.0625 1.0692 1.0619 1.0660 1.0807 1.0640 1.0721 1.0806 1.0728 1.0903 1.0884 1.0889 1.0950 1.0984 1.0989 1.0900 1.1015 1.1046 1.1010 1.0874 1.0928 1.0962
irintensity: 0.0707 0.3206 0.2750 0.3908 0.1204 0.4025 0.8039 0.0513 0.0478 2.4168 0.9346 1.6580 0.0848 2.4228 0.5900 0.2142 0.3102 1.0978 1.9984 1.7507 1.8573 1.8336 2.4165 5.5828 12.8293 1.7774 0.2112 0.1884 0.9966 0.1187 2.3124 1.1949 2.0340 4.7622 0.6929 2.6051 1.1257 3.2787 2.0925 5.9251 4.6578 0.3503 8.2775 0.1747 5.8826 5.5311 36.3238 4.7876 4.4831 21.1269 56.6584 4.6070 4.0853 9.4594 0.6338 4.6028 15.3378 24.7242 4.8273 0.9992 148.0898 38.8635 16.2156 23.7702 153.5978 46.8108 4.9717 33.3714 33.8538 24.2545 18.9831 1.2546 2.8780 5.3776 1.0184 14.5462 2.7961 85.7921 47.0058 1.2528 4.9572 56.6318 13.5185 3.6767 23.4210 30.2973 0.5718 23.8942 9.4443 5.6886 0.9011 11.8172 12.8368 160.9756 62.6932 3.7539 16.0798 1.1208 3.3849 27.8515 11.2003 8.7285 3.0649 8.3173 81.8833 10.4394 16.6160 6.2377 4.0115 14.0086 83.0414 55.6188 0.6695 2.0582 0.1191 1.2209 32.8699 7.6841 2.6301 20.4220 10.6713 6.6489 29.1237 10.2422 12.6553 8.1867 6.2350 16.1496 28.2871 2.8204 15.8689 78.2990 86.9010 40.3431 8.2910 37.3933 345.8714 38.9077 28.6258 33.1760 21.0126 14.0060 8.1185 50.5238 47.0101 48.0833 15.7798 89.3067 43.8293 70.9629 7.6374 26.0899 29.5488 48.2962 37.5442 35.1502 7.0800 14.3272 8.7720
temp: 298.150 k
press: 1.00000 atm
elementType: 9 9 9 7 7 7 6 6 6 6 6 6 6 6 6 6 6 6 6 6 6 6 6 6 6 6 6 1 1 1 1 1 1 1 1 1 1 1 1 1 1 1 1 1 1 1 1 1 1 1 1 1 1 1 1
symmnumber: 1
zpe: 1201911.8 jmol-1
zpe.correction: 0.457784 hartree
zpe.thermalcorrener: 0.483260 hartree
zpe.thermalcorrenthalpy: 0.484204 hartree
zpe.thermalcorrgfe: 0.400084 hartree
zpe.sumelectzpe: -1278.772418 hartree
zpe.sumelectthermal: -1278.746942 hartree
zpe.sumelectthermalent: -1278.745998 hartree
zpe.sumelectthermalfe: -1278.830118 hartree
dipole: -6.2378 2.0811 -1.9405
dipole: 6.8562
quadrupole: -182.3020 -149.7179 -159.9290
quadrupole: 4.2857 -4.6663 0.3476
quadrupole: -18.3190 14.2651 4.0539 4.2857 -4.6663 0.3476
hfenergy: -1279.2302024 hartree
pointgroup: C01 [X(C21H28F3N3)]
dipole: 2.4616239 0.8078335 0.7509621 debye
polarizability: 294.0943326|15.0418582|275.4350344|19.3939326|-10.6398415|183.1532946 unknown
InChI: InChI=1S/C21H28F3N3/c1-25-12-14-26(15-13-25)10-5-11-27-18-8-3-2-6-16(18)20-17(21(22,23)24)7-4-9-19(20)27/h4,7,9H,2-3,5-6,8,10-15H2,1H3
charge 0 multiplicity 1
55 atoms
F  -5.546862 -2.360364 -0.901127
F  -5.696878 -0.284927 -0.013723
F  -4.662963 -0.594469 -2.007575
N  -0.616316 0.565695 1.015276
N  4.351051 0.227009 0.261954
N  6.854745 -0.808962 -0.787927
C  -1.339292 1.601108 0.393692
C  -2.557185 1.111265 -0.09471
C  -0.853528 3.022566 0.293686
C  -3.554707 2.0092 -0.796645
C  -2.592788 -0.304553 0.215372
C  0.73355 0.670908 1.587491
C  -1.715429 3.79701 -0.739285
C  -1.359928 -0.615235 0.909758
C  -3.222059 3.502725 -0.546885
C  1.850399 0.305879 0.579844
C  3.244611 0.371066 1.236993
C  4.438703 -1.135542 -0.324877
C  5.659945 0.609762 0.853547
C  5.554306 -1.198452 -1.380755
C  6.768676 0.551956 -0.20899
C  -3.508433 -1.381623 -0.000506
C  -1.043064 -1.907961 1.37185
C  -3.193317 -2.677962 0.462733
C  -1.97596 -2.939303 1.142172
C  -4.808904 -1.169115 -0.707634
C  7.972888 -0.949081 -1.739581
H  -0.922505 3.522571 1.283425
H  0.21399 3.061501 -0.002565
H  -3.550723 1.802184 -1.885628
H  -4.582657 1.795894 -0.453659
H  0.877158 1.704361 1.951551
H  0.791367 0.010847 2.474281
H  -1.516839 4.881004 -0.643415
H  -1.414119 3.498486 -1.762857
H  -3.820387 4.132769 -1.231615
H  -3.514701 3.7793 0.486369
H  1.648188 -0.704865 0.179723
H  1.828821 1.005057 -0.276869
H  3.308086 -0.398084 2.053618
H  3.362535 1.360677 1.723334
H  3.477962 -1.388567 -0.806938
H  4.645729 -1.90175 0.465695
H  5.941401 -0.066588 1.700336
H  5.5812 1.640701 1.247478
H  5.635101 -2.232354 -1.766038
H  5.276264 -0.530939 -2.236873
H  6.553672 1.321015 -0.995186
H  7.739846 0.801702 0.258323
H  -0.102469 -2.115944 1.893068
H  -3.900851 -3.493565 0.290924
H  -1.762089 -3.955422 1.488323
H  8.924475 -0.703075 -1.234768
H  7.876397 -0.287542 -2.638138
H  8.033587 -1.994871 -2.091045
