program: Orca
programVersion: 5.0.2
elementType: O O C C C C C C C C C C C C C C C C C C C C C H H H H H H H H H H H H H H H H H H H H H H H H H H H H H H Ag
elementType: Ag
charge: 1
multiplicity: 1
keywords: DLPNO-CCSD(T) def2-TZVPP def2-TZVPP/C VeryTightSCF
formula: C21H30O2Ag
InChI: InChI=1S/C21H30O2.Ag/c1-5-6-7-8-16-12-19(22)21(20(23)13-16)18-11-15(4)9-10-17(18)14(2)3;/h11-13,17-18,22-23H,2,5-10H2,1,3-4H3;
54 atoms
O  -0.391544 0.885244 -2.796904
O  -1.448071 1.620821 1.835715
C  -2.191912 -1.025371 0.26576
C  -2.264944 0.255452 -0.599445
C  -3.556294 -1.732171 0.189876
C  -4.642506 -0.865187 0.812667
C  -3.506053 1.055259 -0.260339
C  -0.998195 1.075043 -0.461052
C  -4.568138 0.575625 0.385964
C  -1.087275 -2.018399 -0.035356
C  -0.083974 1.2038 -1.514922
C  -0.61037 1.60214 0.780797
C  -5.755621 1.426977 0.712984
C  -0.706372 -2.892082 1.128134
C  1.625918 2.049941 -0.00935
C  1.237388 1.617041 -1.286687
C  0.680039 2.074205 1.003223
C  3.042995 2.476927 0.269391
C  -0.557805 -2.229183 -1.261517
C  3.839635 1.386963 1.004515
C  4.27738 0.220315 0.118316
C  4.528367 -1.076001 0.884589
C  3.237976 -1.792857 1.262626
H  -2.049334 -0.716041 1.305407
H  -2.359745 -0.071252 -1.640581
H  -3.524888 -2.698928 0.69225
H  -3.787637 -1.93151 -0.860054
H  -4.590775 -0.913482 1.905789
H  -5.626943 -1.259654 0.55034
H  -3.505276 2.090509 -0.58901
H  -5.605306 2.465581 0.42419
H  -5.97018 1.39293 1.783412
H  -6.644418 1.051675 0.201564
H  0.055623 -3.622438 0.861975
H  -0.346718 -2.289784 1.964595
H  -1.580867 -3.434007 1.491968
H  1.897053 1.727201 -2.138194
H  0.924534 2.450566 1.988141
H  3.546598 2.741852 -0.66219
H  3.02157 3.377212 0.884334
H  0.064956 -3.099539 -1.442509
H  -0.894677 -1.683419 -2.134549
H  3.235942 1.025783 1.842162
H  4.729219 1.836245 1.448481
H  3.518953 0.022934 -0.66073
H  5.16895 0.510412 -0.440477
H  -1.339326 0.902945 -2.935453
H  -2.362389 1.507974 1.54543
H  5.097291 -0.855989 1.79092
H  5.147986 -1.747767 0.289076
H  2.741287 -2.186545 0.35362
H  3.407726 -2.66955 1.887062
H  2.549957 -1.141015 1.810704
Ag 1.276841 -0.829586 -0.605962
totalener: -1108.69768504 hartree
nucrepener: 2515.32611397 hartree
electener: -3624.02379901 hartree
oneelecener: -6552.39023291 hartree
twoeener: 2928.36643390 hartree
kineticenergy: 1018.73624866 hartree
chargesum: 1.0000000
charge: -0.394419 -0.394916 0.043656 0.181223 -0.170878 -0.062589 -0.311672 -0.122792 -0.028004 0.017633 0.289963 0.277229 -0.189140 -0.242364 0.067918 -0.252449 -0.213702 -0.151909 -0.344248 -0.147386 -0.043804 -0.096636 -0.140543 0.085604 0.063723 0.090644 0.077035 0.077071 0.092766 0.128132 0.081764 0.079121 0.084987 0.084899 0.084379 0.113343 0.150990 0.122520 0.095635 0.112160 0.151973 0.128979 0.065749 0.096139 -0.039364 0.103692 0.243658 0.253292 0.070154 0.077280 -0.033836 0.112122 0.044745 0.530475
charge: 0.342891 0.341761 -0.036169 -0.056989 0.021315 0.004326 -0.020126 -0.077076 -0.063326 -0.023072 -0.159052 -0.145770 0.039562 0.049042 -0.041571 -0.017866 -0.006334 0.017170 0.023358 -0.002365 -0.007390 -0.013123 0.039060 0.039937 0.027979 0.019929 0.026655 0.028351 0.032143 0.017693 0.019136 0.021111 0.022088 0.023338 0.023986 0.027811 0.034015 0.031316 0.029829 0.032569 0.020468 0.014394 0.017698 0.023651 0.013218 0.023752 -0.109037 -0.116019 0.024859 0.020033 0.013473 0.020865 0.014933 0.351571
qa: -0.3944 -0.3949 0.0437 0.1812 -0.1709 -0.0626 -0.3117 -0.1228 -0.0280 0.0176 0.2900 0.2772 -0.1891 -0.2424 0.0679 -0.2524 -0.2137 -0.1519 -0.3442 -0.1474 -0.0438 -0.0966 -0.1405 0.0856 0.0637 0.0906 0.0770 0.0771 0.0928 0.1281 0.0818 0.0791 0.0850 0.0849 0.0844 0.1133 0.1510 0.1225 0.0956 0.1122 0.1520 0.1290 0.0657 0.0961 -0.0394 0.1037 0.2437 0.2533 0.0702 0.0773 -0.0338 0.1121 0.0447 0.5305
va: 2.0497 2.0493 3.9366 3.7622 3.9414 3.8789 3.7765 3.2999 3.8206 3.5036 3.8094 4.0183 3.9662 3.9836 3.6178 3.7274 3.9767 3.8575 3.8698 3.9109 3.8103 3.9489 3.9332 1.0245 1.0089 1.0140 1.0201 1.0179 1.0133 1.0142 1.0045 1.0019 1.0011 1.0055 1.0000 1.0044 1.0198 1.0166 1.0108 1.0070 1.0230 1.0394 1.0079 1.0148 1.0180 1.0074 1.0026 1.0146 1.0170 1.0140 1.0089 1.0050 1.0183 0.9459
e0: -1108.697685022 hartree
corrType: DLPNO BASED
energy: -1113.631808171276
dipole: -88.39902 88.26765 -0.13137 46.52862 -47.57893 -1.05031 48.19929 -48.14802 0.05127
magnitude: 1.05974 au
magnitude: 2.69364 debye
