program: Orca
programVersion: 5.0.2
elementType: O O C C C C C C C C C C C C C C C C C C C C C H H H H H H H H H H H H H H H H H H H H H H H H H H H H H H Ag
elementType: Ag
charge: 1
multiplicity: 1
keywords: DLPNO-CCSD(T) def2-TZVPP def2-TZVPP/C VeryTightSCF
formula: C21H30O2Ag
InChI: InChI=1S/C21H30O2.Ag/c1-5-6-7-8-16-12-19(22)21(20(23)13-16)18-11-15(4)9-10-17(18)14(2)3;/h11-13,17-18,22-23H,2,5-10H2,1,3-4H3;
54 atoms
O  1.186446 2.129094 1.653565
O  -0.612158 -1.30291 -1.084966
C  -1.846795 1.542526 -0.813054
C  -1.105714 1.145948 0.480749
C  -3.150924 2.242287 -0.417467
C  -4.088246 1.31595 0.353627
C  -2.021235 0.398149 1.430807
C  0.240433 0.472223 0.283529
C  -3.383633 0.472889 1.396401
C  -0.990496 2.373828 -1.742011
C  1.375489 1.030007 0.879843
C  0.476895 -0.667689 -0.483439
C  -4.23801 -0.046191 2.520228
C  -0.467877 3.686373 -1.232331
C  2.846898 -0.618051 -0.088435
C  2.649201 0.503653 0.696393
C  1.729893 -1.208459 -0.673148
C  4.208273 -1.224197 -0.326835
C  -0.731031 1.942286 -2.969667
C  5.385718 -0.545058 0.357315
C  6.709457 -1.234235 0.047961
C  7.90317 -0.570234 0.723852
C  9.221973 -1.262669 0.408549
H  -2.11144 0.634052 -1.366256
H  -0.880163 2.077528 1.005612
H  -3.654806 2.619076 -1.307681
H  -2.918731 3.110483 0.204144
H  -4.648841 0.668892 -0.328774
H  -4.853156 1.901399 0.86938
H  -1.550053 -0.053538 2.301749
H  -4.580192 0.802221 3.117363
H  -3.697441 -0.724296 3.179295
H  -5.134152 -0.545973 2.150307
H  -1.280082 4.351552 -0.931629
H  0.17584 3.550817 -0.360423
H  0.111298 4.195494 -1.999758
H  3.489414 0.987957 1.178295
H  1.846823 -2.101226 -1.27927
H  4.169492 -2.27366 -0.018959
H  4.382082 -1.242534 -1.407195
H  -0.133702 2.523199 -3.660606
H  -1.113047 0.994076 -3.329566
H  5.231052 -0.536257 1.441114
H  5.445602 0.501289 0.041143
H  6.654778 -2.283161 0.358347
H  6.867789 -1.246963 -1.035661
H  2.027276 2.446123 1.985478
H  -0.285576 -1.926707 -1.736365
H  7.743636 -0.558998 1.806425
H  7.955377 0.477881 0.413646
H  10.058941 -0.769796 0.903048
H  9.209014 -2.303526 0.737677
H  9.422226 -1.258497 -0.664628
Ag -2.513793 -1.509575 0.219674
totalener: -1108.70254604 hartree
nucrepener: 2339.09087561 hartree
electener: -3447.79342166 hartree
oneelecener: -6202.54915306 hartree
twoeener: 2754.75573141 hartree
kineticenergy: 1018.70101413 hartree
chargesum: 1.0000000
charge: -0.397358 -0.505521 0.314853 0.035725 -0.214149 -0.042444 -0.267455 -0.106216 -0.019816 -0.173304 0.285466 0.356961 -0.184549 -0.243350 0.065311 -0.196881 -0.242593 -0.089420 -0.147444 -0.043168 -0.108010 -0.022056 -0.202998 0.060280 0.140007 0.106385 0.078473 0.073400 0.107964 0.177866 0.108276 0.081620 0.086881 0.078890 0.070438 0.087387 0.073093 0.074340 0.071578 0.076042 0.079948 0.048561 0.043769 0.044644 0.040334 0.041666 0.225041 0.246385 0.032511 0.033269 0.070685 0.052878 0.053579 0.582229
charge: 0.328144 0.339693 -0.047093 -0.045253 0.019565 0.009117 0.005376 -0.062713 -0.054718 -0.080718 -0.140624 -0.126428 0.042391 0.037545 -0.030303 -0.019813 -0.030473 0.003044 0.027601 -0.020473 -0.021358 -0.032025 0.014960 0.030264 0.046824 0.028070 0.025385 0.027159 0.035604 0.038021 0.030956 0.022189 0.022619 0.014573 0.013911 0.020509 0.017132 0.017773 0.028851 0.030085 0.003084 -0.004927 0.015116 0.015527 0.014557 0.014985 -0.102405 -0.093706 0.010340 0.010584 0.006815 0.005716 0.005922 0.533023
qa: -0.3974 -0.5055 0.3149 0.0357 -0.2141 -0.0424 -0.2675 -0.1062 -0.0198 -0.1733 0.2855 0.3570 -0.1845 -0.2434 0.0653 -0.1969 -0.2426 -0.0894 -0.1474 -0.0432 -0.1080 -0.0221 -0.2030 0.0603 0.1400 0.1064 0.0785 0.0734 0.1080 0.1779 0.1083 0.0816 0.0869 0.0789 0.0704 0.0874 0.0731 0.0743 0.0716 0.0760 0.0799 0.0486 0.0438 0.0446 0.0403 0.0417 0.2250 0.2464 0.0325 0.0333 0.0707 0.0529 0.0536 0.5822
va: 2.0294 1.8586 3.5104 3.5185 3.9304 3.8369 3.7839 3.6817 3.6645 3.7182 4.0207 3.5957 3.9642 4.0064 3.9641 3.8550 4.0859 3.8303 3.9667 3.8502 3.9105 3.8691 3.9778 1.0130 0.9988 1.0191 1.0167 1.0217 1.0152 1.0166 0.9992 1.0035 0.9997 0.9955 1.0001 1.0049 1.0268 1.0240 1.0069 1.0062 1.0175 1.0243 1.0143 1.0142 1.0150 1.0152 1.0195 1.0047 1.0126 1.0126 1.0072 1.0045 1.0045 0.7946
e0: -1108.702546054 hartree
corrType: DLPNO BASED
energy: -1113.613974685845
dipole: 213.86549 -216.14495 -2.27945 111.03628 -112.15506 -1.11879 -8.31785 8.65652 0.33867
magnitude: 2.56170 au
magnitude: 6.51131 debye
