program: Orca
programVersion: 5.0.2
elementType: O O C C C C C C C C C C C C C C C C C C C C C H H H H H H H H H H H H H H H H H H H H H H H H H H H H H H Ag
elementType: Ag
charge: 1
multiplicity: 1
keywords: DLPNO-CCSD(T) def2-TZVPP def2-TZVPP/C VeryTightSCF
formula: C21H30O2Ag
InChI: InChI=1S/C21H30O2.Ag/c1-5-6-7-8-16-12-19(22)21(20(23)13-16)18-11-15(4)9-10-17(18)14(2)3;/h11-13,17-18,22-23H,2,5-10H2,1,3-4H3;
54 atoms
O  -1.120727 1.273548 1.936367
O  -0.752841 1.148259 -2.796611
C  -2.394561 -0.924617 0.001523
C  -2.377661 0.51349 -0.580196
C  -3.837592 -1.446383 -0.034172
C  -4.705759 -0.615769 0.904043
C  -3.43737 1.356621 0.094116
C  -0.991187 1.106687 -0.458298
C  -4.474995 0.867049 0.773145
C  -1.438577 -1.89241 -0.658207
C  -0.410113 1.335794 0.797135
C  -0.173407 1.290173 -1.581806
C  -5.489543 1.75269 1.428226
C  -1.554203 -2.112494 -2.135281
C  1.775217 1.69213 -0.197634
C  0.964188 1.579715 0.930536
C  1.189473 1.559194 -1.460015
C  3.250286 1.972358 -0.067315
C  -0.606027 -2.654251 0.102638
C  4.155205 0.846177 -0.586049
C  4.033533 -0.49216 0.137036
C  4.247223 -0.464451 1.649209
C  5.620756 0.055777 2.055531
H  -2.104484 -0.865306 1.054556
H  -2.616695 0.461687 -1.643787
H  -3.871195 -2.497679 0.256094
H  -4.22712 -1.378616 -1.05286
H  -4.533788 -0.910673 1.944886
H  -5.761012 -0.824565 0.713895
H  -3.335615 2.431491 -0.023068
H  -5.226761 2.805535 1.343012
H  -5.590712 1.505288 2.487342
H  -6.472041 1.605081 0.975084
H  -0.814815 -2.823941 -2.497314
H  -2.545989 -2.512673 -2.356809
H  -1.458443 -1.181405 -2.693047
H  1.362995 1.739557 1.923735
H  1.790624 1.692189 -2.352616
H  3.479918 2.881805 -0.625929
H  3.482036 2.187867 0.976229
H  -0.068623 -3.487757 -0.336552
H  -0.676738 -2.626387 1.186001
H  5.188836 1.187414 -0.510794
H  3.973643 0.690791 -1.652426
H  3.041274 -0.953467 -0.075887
H  4.734294 -1.196062 -0.318151
H  -2.069013 1.301495 1.7451
H  -0.130005 1.363259 -3.492644
H  4.118182 -1.478695 2.033711
H  3.470189 0.138602 2.128011
H  6.416159 -0.517199 1.575556
H  5.757692 1.104022 1.786278
H  5.759969 -0.023395 3.132957
Ag 0.955437 -0.959313 -0.077753
totalener: -1108.70570784 hartree
nucrepener: 2494.84813929 hartree
electener: -3603.55384713 hartree
oneelecener: -6511.74042770 hartree
twoeener: 2908.18658057 hartree
kineticenergy: 1018.72254995 hartree
chargesum: 1.0000000
charge: -0.394989 -0.389248 0.142528 0.191796 -0.197611 -0.064928 -0.352671 -0.241428 -0.016473 0.039889 0.359080 0.303058 -0.188087 -0.261956 -0.010170 -0.226911 -0.184027 -0.159366 -0.386887 -0.130434 -0.053537 -0.074869 -0.211399 0.083677 0.124884 0.102022 0.075320 0.075935 0.092794 0.128888 0.081382 0.077264 0.084645 0.087554 0.118072 0.101124 0.117070 0.085909 0.118245 0.092903 0.143690 0.155242 0.094717 0.074019 -0.029809 0.098363 0.257224 0.229607 0.066235 0.021306 0.070670 0.055490 0.085585 0.538611
charge: 0.345426 0.340688 -0.041023 -0.047707 0.019437 0.004848 -0.013866 -0.066815 -0.065011 -0.013350 -0.146877 -0.148950 0.038108 0.055099 -0.043504 -0.000221 -0.021746 0.015567 0.006543 -0.002904 0.001961 -0.027934 0.023792 0.040454 0.039522 0.023653 0.024138 0.027543 0.031602 0.018970 0.018887 0.020150 0.021734 0.024005 0.031961 0.021300 0.031389 0.021765 0.034182 0.028358 0.019031 0.022473 0.026270 0.017735 0.006194 0.027763 -0.112970 -0.098930 0.017093 0.009271 0.012059 0.004395 0.012270 0.366173
qa: -0.3950 -0.3892 0.1425 0.1918 -0.1976 -0.0649 -0.3527 -0.2414 -0.0165 0.0399 0.3591 0.3031 -0.1881 -0.2620 -0.0102 -0.2269 -0.1840 -0.1594 -0.3869 -0.1304 -0.0535 -0.0749 -0.2114 0.0837 0.1249 0.1020 0.0753 0.0759 0.0928 0.1289 0.0814 0.0773 0.0846 0.0876 0.1181 0.1011 0.1171 0.0859 0.1182 0.0929 0.1437 0.1552 0.0947 0.0740 -0.0298 0.0984 0.2572 0.2296 0.0662 0.0213 0.0707 0.0555 0.0856 0.5386
va: 2.0605 2.0479 3.7660 3.7161 3.9539 3.8849 3.8370 3.4835 3.7951 3.4050 3.8742 3.8505 3.9660 4.0044 3.5941 3.8501 3.8715 3.8814 3.9336 3.8877 3.8521 3.8968 3.9801 1.0258 0.9928 1.0119 1.0138 1.0183 1.0129 1.0133 1.0041 1.0019 1.0010 1.0061 0.9958 1.0003 1.0250 1.0242 1.0050 1.0077 1.0276 1.0273 1.0073 1.0180 1.0494 1.0047 1.0175 1.0166 1.0130 1.0135 1.0065 1.0023 1.0067 0.9541
e0: -1108.705707787 hartree
corrType: DLPNO BASED
energy: -1113.638407911757
dipole: -62.52305 62.71560 0.19255 63.02190 -63.72334 -0.70144 10.11914 -10.96236 -0.84322
magnitude: 1.11361 au
magnitude: 2.83056 debye
