program: Orca
programVersion: 5.0.2
elementType: O O C C C C C C C C C C C C C C C C C C C C C H H H H H H H H H H H H H H H H H H H H H H H H H H H H H H Ag
elementType: Ag
charge: 1
multiplicity: 1
keywords: DLPNO-CCSD(T) def2-TZVPP def2-TZVPP/C VeryTightSCF
formula: C21H30O2Ag
InChI: InChI=1S/C21H30O2.Ag/c1-5-6-7-8-16-12-19(22)21(20(23)13-16)18-11-15(4)9-10-17(18)14(2)3;/h11-13,17-18,22-23H,2,5-10H2,1,3-4H3;
54 atoms
O  -1.270163 1.480522 1.888404
O  -0.659376 0.995625 -2.742115
C  -2.32737 -0.883089 0.30244
C  -2.296282 0.414208 -0.539936
C  -3.7097 -1.529718 0.123379
C  -4.784517 -0.622232 0.711549
C  -3.482572 1.283118 -0.192507
C  -0.966696 1.127228 -0.419938
C  -4.60166 0.831199 0.36107
C  -1.225343 -1.86642 -0.010757
C  -0.450743 1.542382 0.815937
C  -0.148336 1.334239 -1.537009
C  -5.751909 1.733104 0.689556
C  -1.050439 -2.310823 -1.431059
C  1.69224 2.10841 -0.182326
C  0.881518 1.96285 0.947066
C  1.151889 1.827187 -1.425921
C  3.143203 2.481367 -0.029844
C  -0.507496 -2.440308 0.99502
C  4.098784 1.331135 -0.387919
C  3.77831 0.005213 0.292594
C  4.842135 -1.074041 0.136363
C  4.40765 -2.404952 0.732607
H  -2.235297 -0.604669 1.353805
H  -2.394163 0.131932 -1.589997
H  -3.73848 -2.508428 0.605794
H  -3.903555 -1.687887 -0.940487
H  -4.805128 -0.718648 1.802681
H  -5.768546 -0.953249 0.370518
H  -3.392541 2.335712 -0.438382
H  -6.000986 1.668682 1.751603
H  -6.646426 1.437597 0.136745
H  -5.531057 2.772501 0.452794
H  -0.892238 -1.467401 -2.103594
H  -0.228067 -3.01541 -1.538599
H  -1.966453 -2.804295 -1.762703
H  1.252989 2.262655 1.921379
H  1.753027 1.9518 -2.319892
H  3.371506 3.341409 -0.661354
H  3.324401 2.793049 1.000309
H  0.13078 -3.294991 0.797323
H  -0.775402 -2.250373 2.030024
H  5.111079 1.632812 -0.111556
H  4.110503 1.180157 -1.470115
H  3.585338 0.168517 1.360561
H  2.85468 -0.399371 -0.179805
H  -0.866033 1.905644 2.646707
H  -0.048832 1.22811 -3.443201
H  5.761555 -0.733186 0.617888
H  5.076991 -1.198246 -0.923673
H  5.179663 -3.16528 0.623397
H  4.19018 -2.309719 1.799041
H  3.508791 -2.784083 0.235973
Ag 0.996276 -0.70713 0.741659
totalener: -1108.70621879 hartree
nucrepener: 2493.54440958 hartree
electener: -3602.25062837 hartree
oneelecener: -6509.74495126 hartree
twoeener: 2907.49432290 hartree
kineticenergy: 1018.71449422 hartree
chargesum: 1.0000000
charge: -0.371128 -0.383455 0.175581 0.211325 -0.214292 -0.063825 -0.246347 -0.172737 -0.018888 0.053272 0.264397 0.322693 -0.195447 -0.259039 -0.007050 -0.209566 -0.161086 -0.159923 -0.389709 -0.097800 -0.044034 -0.044270 -0.188107 0.094553 0.102154 0.096245 0.069756 0.067344 0.083168 0.076091 0.068916 0.075353 0.074108 0.095453 0.085567 0.122317 0.099057 0.083335 0.114275 0.084452 0.143217 0.149079 0.088451 0.062036 0.062609 -0.065668 0.223558 0.226713 0.062528 0.054464 0.096723 0.057685 0.019525 0.526373
charge: 0.357325 0.341687 -0.038881 -0.043933 0.018315 0.003403 -0.000864 -0.055371 -0.073063 -0.011155 -0.149003 -0.143757 0.033878 0.055100 -0.046547 -0.029564 -0.024658 0.015046 0.001160 0.002149 -0.006065 -0.017553 0.019527 0.039884 0.037266 0.021107 0.021987 0.025135 0.027832 0.015948 0.016626 0.017003 0.016406 0.023691 0.022693 0.033080 0.022347 0.020983 0.032791 0.028370 0.017315 0.021080 0.026688 0.019480 0.025840 0.017928 -0.098480 -0.099771 0.020911 0.019214 0.015861 0.009112 0.003368 0.371130
qa: -0.3711 -0.3835 0.1756 0.2113 -0.2143 -0.0638 -0.2463 -0.1727 -0.0189 0.0533 0.2644 0.3227 -0.1954 -0.2590 -0.0070 -0.2096 -0.1611 -0.1599 -0.3897 -0.0978 -0.0440 -0.0443 -0.1881 0.0946 0.1022 0.0962 0.0698 0.0673 0.0832 0.0761 0.0689 0.0754 0.0741 0.0955 0.0856 0.1223 0.0991 0.0833 0.1143 0.0845 0.1432 0.1491 0.0885 0.0620 0.0626 -0.0657 0.2236 0.2267 0.0625 0.0545 0.0967 0.0577 0.0195 0.5264
va: 2.0885 2.0526 3.7194 3.6880 3.9976 3.9016 3.8692 3.4539 3.7920 3.4041 3.8043 3.9077 3.9728 4.0113 3.7610 3.7257 3.9460 3.8830 3.9113 3.8617 3.8594 3.8780 3.9432 1.0242 1.0096 1.0112 1.0133 1.0134 1.0129 1.0222 1.0003 1.0008 1.0046 0.9991 1.0061 0.9958 1.0260 1.0200 1.0067 1.0155 1.0277 1.0294 1.0186 1.0215 1.0142 1.0313 1.0209 1.0182 1.0185 1.0148 1.0138 1.0056 1.0073 0.9640
e0: -1108.706218752 hartree
corrType: DLPNO BASED
energy: -1113.634625196697
dipole: -66.68694 68.20248 1.51554 43.35512 -43.62569 -0.27056 -40.94887 41.10618 0.15730
magnitude: 1.54752 au
magnitude: 3.93348 debye
