program: Orca
programVersion: 5.0.2
elementType: O O C C C C C C C C C C C C C C C C C C C C C H H H H H H H H H H H H H H H H H H H H H H H H H H H H H H Ag
elementType: Ag
charge: 1
multiplicity: 1
keywords: wB97X-D3 Opt Freq def2-TZVPP def2/J RIJCOSX TightSCF defgrid3 CHELPG
frequency: 0.00 0.00 0.00 0.00 0.00 0.00 12.85 25.36 35.85 38.62 43.06 65.52 82.72 84.92 101.47 105.60 118.06 130.58 143.99 161.20 180.07 188.73 191.52 228.44 235.47 245.68 251.75 262.12 270.34 286.30 310.87 325.96 331.12 345.70 361.37 375.92 392.34 418.93 452.49 464.76 477.54 483.81 500.33 538.20 549.15 561.17 570.65 592.30 617.44 631.16 657.39 679.51 737.31 743.88 772.19 796.14 799.24 808.96 824.50 852.66 872.53 886.76 909.09 918.53 931.51 939.54 957.52 960.48 991.46 1000.94 1011.38 1017.79 1032.57 1041.37 1046.42 1057.41 1063.02 1071.14 1082.32 1101.45 1118.41 1125.46 1137.22 1143.13 1163.03 1186.98 1194.58 1213.58 1218.06 1218.82 1250.88 1254.89 1275.64 1295.59 1302.25 1306.37 1317.37 1327.71 1333.68 1341.04 1343.09 1352.97 1363.94 1370.52 1386.26 1393.02 1396.65 1404.15 1408.70 1420.60 1425.84 1430.16 1430.70 1463.25 1480.07 1486.30 1490.37 1491.92 1493.65 1495.90 1496.54 1499.83 1501.04 1505.40 1507.13 1508.57 1514.21 1584.54 1638.61 1664.94 1716.73 1748.00 3032.61 3036.91 3048.95 3050.18 3052.06 3053.22 3059.86 3060.12 3070.40 3072.14 3077.41 3088.18 3090.59 3096.20 3098.76 3120.48 3123.57 3125.94 3127.34 3128.43 3138.15 3147.30 3154.20 3159.40 3160.22 3178.41 3188.93 3247.62 3883.17 3904.56
frequency: 12.85 25.36 35.85 38.62 43.06 65.52 82.72 84.92 101.47 105.60 118.06 130.58 143.99 161.20 180.07 188.73 191.52 228.44 235.47 245.68 251.75 262.12 270.34 286.30 310.87 325.96 331.12 345.70 361.37 375.92 392.34 418.93 452.49 464.76 477.54 483.81 500.33 538.20 549.15 561.17 570.65 592.30 617.44 631.16 657.39 679.51 737.31 743.88 772.19 796.14 799.24 808.96 824.50 852.66 872.53 886.76 909.09 918.53 931.51 939.54 957.52 960.48 991.46 1000.94 1011.38 1017.79 1032.57 1041.37 1046.42 1057.41 1063.02 1071.14 1082.32 1101.45 1118.41 1125.46 1137.22 1143.13 1163.03 1186.98 1194.58 1213.58 1218.06 1218.82 1250.88 1254.89 1275.64 1295.59 1302.25 1306.37 1317.37 1327.71 1333.68 1341.04 1343.09 1352.97 1363.94 1370.52 1386.26 1393.02 1396.65 1404.15 1408.70 1420.60 1425.84 1430.16 1430.70 1463.25 1480.07 1486.30 1490.37 1491.92 1493.65 1495.90 1496.54 1499.83 1501.04 1505.40 1507.13 1508.57 1514.21 1584.54 1638.61 1664.94 1716.73 1748.00 3032.61 3036.91 3048.95 3050.18 3052.06 3053.22 3059.86 3060.12 3070.40 3072.14 3077.41 3088.18 3090.59 3096.20 3098.76 3120.48 3123.57 3125.94 3127.34 3128.43 3138.15 3147.30 3154.20 3159.40 3160.22 3178.41 3188.93 3247.62 3883.17 3904.56
formula: C21H30O2Ag
InChI: InChI=1S/C21H30O2.Ag/c1-5-6-7-8-16-12-19(22)21(20(23)13-16)18-11-15(4)9-10-17(18)14(2)3;/h11-13,17-18,22-23H,2,5-10H2,1,3-4H3;
54 atoms
O  1.509169 2.475845 1.083087
O  -0.291481 -1.253741 -1.236646
C  -1.739909 1.488068 -0.929281
C  -0.808149 1.225564 0.272173
C  -3.041963 2.093499 -0.395589
C  -3.784786 1.133556 0.530498
C  -1.522601 0.454241 1.364787
C  0.559005 0.66162 -0.070763
C  -2.879405 0.411162 1.506553
C  -1.085375 2.340474 -1.993239
C  1.702875 1.354978 0.342754
C  0.800889 -0.494903 -0.809037
C  -3.533361 -0.117399 2.75364
C  -0.650145 3.727355 -1.614843
C  3.184297 -0.215409 -0.733184
C  2.984011 0.932426 0.013996
C  2.066414 -0.93577 -1.137854
C  4.568289 -0.706032 -1.063286
C  -0.918332 1.8604 -3.218862
C  4.98508 -1.925699 -0.227866
C  5.010247 -1.69373 1.280944
C  6.04739 -0.677936 1.749243
C  6.066321 -0.516499 3.263299
H  -1.986953 0.532616 -1.405927
H  -0.605974 2.200011 0.723384
H  -3.687509 2.378102 -1.226671
H  -2.812958 3.010386 0.152984
H  -4.366036 0.405245 -0.04416
H  -4.528169 1.678667 1.117083
H  -0.905344 0.093027 2.185279
H  -4.418683 -0.712191 2.525286
H  -3.874821 0.729656 3.3531
H  -2.853559 -0.709162 3.365307
H  -1.492435 4.331524 -1.271291
H  0.084867 3.711775 -0.807021
H  -0.201502 4.236516 -2.465162
H  3.836756 1.511836 0.350241
H  2.188375 -1.847423 -1.713897
H  4.609051 -0.972373 -2.121478
H  5.282093 0.106446 -0.923136
H  -0.463147 2.452065 -4.002689
H  -1.237064 0.858886 -3.483285
H  5.974733 -2.245277 -0.563923
H  4.306919 -2.754184 -0.451173
H  4.017077 -1.382052 1.623329
H  5.209089 -2.649445 1.773569
H  2.351103 2.88446 1.287854
H  0.008653 -1.885659 -1.892931
H  5.857424 0.295572 1.287638
H  7.036566 -0.986675 1.398505
H  6.814103 0.211001 3.579172
H  5.096037 -0.179244 3.635053
H  6.29594 -1.462486 3.756861
Ag -1.98598 -1.554205 0.317507
totalener: -1115.65141566 hartree
nucrepener: 2406.62175348 hartree
electener: -3522.27316913 hartree
oneelecener: -6339.49169703 hartree
twoeener: 2817.21852790 hartree
kineticenergy: 1020.57186290 hartree
xcener: -106.946775349794 hartree
chargesum: 1.0000000
charge: -0.296678 -0.384198 0.187626 0.031518 -0.213344 -0.071727 -0.218611 -0.215860 0.000006 -0.168834 0.266221 0.343629 -0.189152 -0.254975 -0.010525 -0.174495 -0.161282 -0.160366 -0.162194 -0.135542 -0.130521 -0.095482 -0.250132 0.085271 0.128080 0.112611 0.098550 0.103514 0.114489 0.186302 0.109647 0.124767 0.095397 0.100626 0.096739 0.095943 0.090658 0.088445 0.107139 0.096843 0.094261 0.069755 0.089372 0.076381 0.055814 0.087481 0.188662 0.212916 0.038819 0.073469 0.094955 0.064411 0.082724 0.400877
charge: 0.366972 0.382075 -0.055603 -0.051468 0.010391 0.001272 -0.002378 -0.059754 -0.069124 -0.093238 -0.173966 -0.154309 0.034137 0.027253 -0.054963 -0.011537 -0.020416 -0.003405 0.030892 -0.020002 -0.034825 -0.045986 0.001004 0.036197 0.051291 0.035164 0.031835 0.036941 0.042776 0.046090 0.030411 0.037529 0.028341 0.020968 0.018132 0.026432 0.022851 0.023602 0.032869 0.029004 0.007245 -0.001402 0.026289 0.018326 0.016304 0.023736 -0.102874 -0.091921 0.007388 0.020908 0.012487 0.007667 0.013585 0.488805
qa: -0.2967 -0.3842 0.1876 0.0315 -0.2133 -0.0717 -0.2186 -0.2159 0.0000 -0.1688 0.2662 0.3436 -0.1892 -0.2550 -0.0105 -0.1745 -0.1613 -0.1604 -0.1622 -0.1355 -0.1305 -0.0955 -0.2501 0.0853 0.1281 0.1126 0.0985 0.1035 0.1145 0.1863 0.1096 0.1248 0.0954 0.1006 0.0967 0.0959 0.0907 0.0884 0.1071 0.0968 0.0943 0.0698 0.0894 0.0764 0.0558 0.0875 0.1887 0.2129 0.0388 0.0735 0.0950 0.0644 0.0827 0.4009
va: 2.1671 2.0478 3.6301 3.4678 3.9336 3.8560 3.7884 3.8603 3.6722 3.7705 4.0404 3.6021 3.9497 3.9549 3.8973 3.9762 4.1043 3.8730 3.9498 3.8800 3.8720 3.8799 3.9562 1.0093 1.0195 1.0170 1.0094 1.0130 1.0166 1.0234 0.9973 0.9971 1.0063 0.9957 1.0073 1.0110 1.0215 1.0256 1.0068 1.0012 1.0203 1.0242 1.0157 1.0102 1.0053 1.0101 1.0478 1.0314 1.0102 1.0096 1.0062 1.0020 1.0052 1.1056
dispcorr: -0.030541476 hartree
energy: -1115.688743632669
dipole: 169.41053 -171.05562 -1.64508 114.63846 -115.52734 -0.88888 -7.12557 7.37773 0.25216
magnitude: 1.88680 au
magnitude: 4.79585 debye
temp: 298.15 k
press: 1.00 atm
zeropoint: 0.47219594 hartree
thermalvibcorrection: 0.02335646 hartree
thermalrotcorrection: 0.00141627 hartree
thermaltrasncorrection: 0.00141627 hartree
thermaltotal: -1115.19035870 hartree
thermalcorr: 0.02618900 hartree
nonthermalcorr: 0.47219594 hartree
totalcorr: 0.49838494 hartree
thermalcorrenthalpy: 0.00094421 hartree
totalenthalpy: -1115.18941449 hartree
totalentropycorr: -0.07993116 hartree
gibbsenthalpy: -1115.26934565 hartree
gibbsminuselec: 0.41939798 hartree
