program: Gaussian 09
title: 000005320
version: EM64L-G09RevD.01
frameworkgroup: C1[X(C8H10N2O3S)]
method: RPBEPBE
basis: SDD
operation: Freq
keyword: #p
keyword: freq=noraman
keyword: PBEPBE/SDD
title: #p freq=noraman PBEPBE/SDD
converged: YES YES NO NO
title: Mulliken charges:
elementType: S O O O N N C C C C C C C C H H H H H H H H H H
charge: 1.003589 -0.550730 -0.487156 -0.262346 -0.617215 -0.686803 -0.112072 -0.227679 -0.146796 0.517437 -0.390050 -0.407475 0.339784 -0.743328 0.286039 0.299168 0.348718 0.231549 0.233656 0.258841 0.259755 0.221146 0.315025 0.316946
chargesum: 0.00000
title: Mulliken charges with hydrogens summed into heavy atoms:
elementType: S O O O N N C C C C C C C C
charge: 1.003589 -0.550730 -0.487156 -0.262346 -0.268498 -0.054832 -0.112072 0.058359 0.152372 0.517437 -0.158501 -0.173819 0.339784 -0.003586
polarizability: 1.92990705e+02 1.25984109e+01 1.24407934e+02 4.36772066e+00 -1.67837746e+01 1.08036375e+02
1716.lowfreq: -21.9180 -4.9876 -0.0005 0.0008 0.0012 7.3323 13.1175 35.1018 52.2533
frequency: -18.1366 35.0384 52.2468 83.0626 103.8687 121.0446 138.0514 186.1729 226.8135 238.0991 261.3203 303.5849 328.9269 404.0806 407.6213 412.5953 415.8583 430.1302 441.2369 483.1845 507.9364 533.6958 590.9177 604.3430 622.1546 683.7076 717.6136 801.6594 807.7259 816.6817 832.6038 912.8785 941.4169 955.5559 965.3742 976.5793 979.4304 1022.9115 1032.7937 1048.1409 1133.5709 1165.1647 1186.7439 1303.3361 1324.0030 1325.8251 1381.3097 1401.7422 1436.7671 1448.4808 1463.5149 1488.5408 1583.6131 1604.6828 1612.8785 1648.9959 2999.7597 3096.8442 3118.6993 3135.9183 3139.8176 3163.5568 3181.3361 3504.7527 3562.1124 3701.0113
redmass: 1.1157 3.5371 3.9883 5.7093 5.4667 7.4381 7.7252 5.7377 9.4779 7.7611 7.2046 5.4885 5.8685 3.2857 4.3906 2.2986 1.1723 3.7794 1.4994 1.4689 2.6733 3.8044 2.7538 5.3265 6.8999 4.9533 2.9231 4.4634 1.3950 9.8334 1.7998 6.7302 1.3974 4.0185 1.3568 1.9833 5.0532 1.4454 1.6413 2.5146 1.1966 1.5207 1.1174 1.2952 2.5527 2.7639 1.2005 5.6145 3.7701 1.0643 1.0692 2.9101 7.3967 8.8395 4.8596 1.2221 1.0355 1.0988 1.1006 1.0891 1.0902 1.0959 1.0955 1.0797 1.0452 1.1040
irintensity: 0.5997 0.2773 4.3986 10.0780 1.2902 2.2246 1.9412 5.9394 3.0148 4.5386 1.5457 13.9557 7.1893 4.3530 3.4487 2.3042 0.2905 77.3653 368.8012 105.5798 29.3216 71.6104 3.0216 23.9498 1.6809 113.6341 1.8954 30.5658 1.8222 100.3018 80.2401 8.9030 1.9032 68.9667 1.2510 17.1724 9.5478 1.7455 15.2485 57.8519 14.5520 51.9712 39.1038 7.5506 98.1909 226.3162 10.1174 6.6397 3.7454 19.0420 19.7439 65.2287 3.9508 163.6248 190.1294 263.7809 7.8640 11.2543 9.5346 12.7892 12.4722 7.5149 7.7295 45.5814 113.1320 26.1874
temp: 298.150 k
press: 1.00000 atm
elementType: 16 8 8 8 7 7 6 6 6 6 6 6 6 6 1 1 1 1 1 1 1 1 1 1
symmnumber: 1
zpe: 457811.1 jmol-1
zpe.correction: 0.174371 hartree
zpe.thermalcorrener: 0.188534 hartree
zpe.thermalcorrenthalpy: 0.189478 hartree
zpe.thermalcorrgfe: 0.132839 hartree
zpe.sumelectzpe: -1042.886431 hartree
zpe.sumelectthermal: -1042.872268 hartree
zpe.sumelectthermalent: -1042.871324 hartree
zpe.sumelectthermalfe: -1042.927963 hartree
dipole: -4.7000 -3.5359 -4.1077
dipole: 7.1739
quadrupole: -52.9789 -99.4022 -90.7945
quadrupole: 0.2200 -6.8443 -2.6020
quadrupole: 28.0796 -18.3436 -9.7360 0.2200 -6.8443 -2.6020
hfenergy: -1043.0608022 hartree
pointgroup: C01 [X(C8H10N2O3S1)]
dipole: -1.8651824 1.5553007 1.4381703 debye
dipolederiv: 2.5388467 0.1133281 0.1011866 0.0867888 1.7176561 0.2232813 0.2842192 0.3827705 1.3133481 -0.7382652 0.0381249 -0.0499766 -0.0092692 -0.7227487 -0.0006157 -0.0455162 0.1848672 -0.5351457 -0.7489002 0.058416 0.0750719 -0.0081827 -0.4974978 -0.0296768 0.009194 -0.1939089 -0.6211699 -0.5415536 0.1368776 -0.1785671 -0.1769989 -0.6730148 0.1117437 -0.0661003 0.3480892 -0.5695374 -0.9391033 -0.266908 0.0537651 -0.3989849 -1.2802442 0.014433 0.0153926 0.0275828 -0.5666182 -1.6129068 0.3961863 -0.1137221 0.4833739 -0.6492961 -0.2840942 -0.0900683 -0.291598 -0.3329461 -0.5131692 0.0572864 0.0198506 0.1689762 -0.3604844 0.0361589 0.1061541 -0.0183799 -0.2794004 0.3320642 -0.0895416 -0.0798948 0.0789151 -0.047493 -0.0466817 -0.3604886 0.0293957 0.004708 0.177136 -0.0871482 0.0043957 -0.2454827 0.1205697 -0.0691953 0.2411385 -0.1168832 0.009331 1.6413151 -0.5712359 0.0041826 -0.6533223 0.3746508 0.0490048 0.0012591 0.0583303 0.1132062 -0.4191186 0.0916508 -0.0627798 0.3903761 -0.256196 -0.1121354 -0.360843 0.0066748 -0.0625149 -0.5903629 0.1394386 -0.0242948 -0.0884197 -0.0654242 -0.1300974 0.2710105 -0.2277737 -0.0639924 0.583636 0.0214177 0.2620207 0.6495202 1.4345328 -0.1604119 -0.0512859 -0.6812234 0.5248711 -0.2541474 -0.1515743 -0.1552344 -0.2673165 -0.1707824 -0.1392532 -0.0651266 -0.0092383 0.013325 0.1606756 0.0455883 -0.0307796 0.0065137 0.0901829 0.0621048 -0.0104137 0.0396068 0.1000008 0.1391764 -0.0076027 0.065299 -0.00625 0.1258342 0.0154879 0.0490465 0.017114 0.1259417 0.1912396 -0.0571127 -0.0936374 -0.159335 0.0854181 -0.0114985 -0.077041 0.0155574 0.2283913 -0.0588169 -0.0036625 0.1112377 0.0211479 0.1115785 0.0684766 0.1088409 0.0742724 0.0411155 0.0159744 0.0816306 -0.0291715 0.086947 0.0354461 0.122987 -0.0178398 0.1097078 0.0472363 -0.0342453 -0.0288524 0.050566 -0.0178876 0.0977508 -0.0244552 0.0745376 -0.0217999 0.0279534 0.0642718 0.0436485 -0.0114134 0.0055198 -0.0677508 -0.0514504 -0.0423144 -0.0322996 0.0969159 0.1012865 -0.0026493 -0.0206415 0.0242136 0.0448812 0.1242306 -0.0716515 0.0672008 -0.0645951 0.2691857 0.0265608 0.0383988 0.0482612 0.2599708 0.1219933 0.0004166 0.1324936 0.224888 0.2357814 0.016133 0.0641384 -0.0191037 0.2924605 0.1096638 0.0974798 0.0994415 0.2246879 unknown
polarizability: 191.9803136|-14.8521874|123.8086982|0.0917102|-18.2361805|109.6460028 unknown
InChI: InChI=1S/C8H10N2O3S/c1-6(11)10-14(12,13)8-4-2-7(9)3-5-8/h2-5,10H,9H2,1H3
charge 0 multiplicity 1
24 atoms
S  1.138848 -1.349812 -0.109187
O  1.158697 -2.627111 0.900496
O  1.656672 -1.476903 -1.634608
O  1.947355 1.66926 -0.538438
N  2.282126 -0.185416 0.826806
N  -4.384947 1.091564 0.039114
C  -0.539512 -0.553261 -0.050982
C  -1.436132 -1.003201 0.936162
C  -0.87154 0.421031 -1.010947
C  -3.109365 0.544593 0.0103
C  -2.726497 -0.449425 0.963756
C  -2.164042 0.967172 -0.976206
C  2.562332 1.11161 0.414236
C  3.673114 1.802417 1.207113
H  -1.131685 -1.778896 1.646081
H  -0.132168 0.748799 -1.746413
H  2.80508 -0.682359 1.557485
H  -3.446071 -0.786158 1.718586
H  -2.446836 1.73076 -1.709395
H  4.5928 1.809163 0.594823
H  3.377991 2.84882 1.386298
H  3.894315 1.314706 2.171153
H  -5.065625 0.795815 0.733216
H  -4.666511 1.795433 -0.637548
