program: Gaussian 09
title: 000034565
version: EM64L-G09RevD.01
frameworkgroup: C1[X(C14H14N2O2)]
method: RPBEPBE
basis: SDD
operation: Freq
keyword: #p
keyword: freq=noraman
keyword: PBEPBE/SDD
title: #p freq=noraman PBEPBE/SDD
converged: YES YES NO NO
title: Mulliken charges:
elementType: O O N N C C C C C C C C C C C C C C H H H H H H H H H H H H H H
charge: -0.234399 -0.258497 -0.086769 -0.115805 0.031866 0.227494 0.146514 0.320243 -0.274219 -0.324403 -0.292661 -0.337142 -0.332692 -0.317565 -0.230252 -0.236133 -0.539332 -0.538033 0.278636 0.251506 0.284122 0.242684 0.253269 0.240556 0.228227 0.225584 0.221523 0.221583 0.247505 0.224811 0.224806 0.246972
chargesum: 0.00000
title: Mulliken charges with hydrogens summed into heavy atoms:
elementType: O O N N C C C C C C C C C C C C C C
charge: -0.234399 -0.258497 -0.086769 -0.115805 0.031866 0.227494 0.146514 0.320243 0.004417 -0.072896 -0.008539 -0.094459 -0.079423 -0.077009 -0.002024 -0.010550 0.151280 0.158556
polarizability: 4.22702787e+02 1.08740886e+01 1.87952821e+02 -2.88570587e-01 2.51314788e-01 7.66915561e+01
1716.lowfreq: -4.8265 -0.0011 -0.0007 -0.0005 3.6723 11.3817 19.8184 47.0759 51.4025
frequency: 19.5935 47.0295 51.3923 88.2305 104.1648 116.1296 160.8088 174.4128 192.4382 194.4033 238.3272 255.1159 256.1742 290.8797 306.9271 380.9574 403.7998 423.3486 447.0910 480.1722 503.5421 526.1871 541.8574 557.5157 571.1272 613.1603 629.4987 723.0539 733.3392 753.6595 761.9354 769.0854 820.0081 827.6784 846.5746 858.7173 897.5898 951.6498 969.2719 978.7756 982.4059 983.1232 987.5826 992.6887 1037.8106 1094.2956 1104.9620 1110.9642 1111.2457 1142.2224 1150.5930 1157.2593 1169.0076 1180.4634 1219.9296 1223.3605 1245.7375 1264.8235 1291.2990 1341.4663 1376.5558 1386.3052 1426.0717 1431.5798 1437.1416 1440.8094 1465.7940 1468.0635 1470.9318 1472.5352 1478.7802 1486.0650 1571.7167 1581.9599 1593.1423 1609.8599 2961.1104 2965.0454 3050.5350 3055.3922 3127.1888 3128.2423 3131.3353 3148.5358 3148.7095 3151.5947 3164.9105 3167.9957 3174.1869 3174.9870
redmass: 3.8965 4.6582 4.8654 3.7661 3.2106 4.5950 4.6148 5.0055 3.3876 5.2592 1.2585 3.5842 1.3615 3.5742 3.2148 5.2154 5.7117 3.2142 6.2265 3.1890 4.7353 2.8517 7.1532 3.1582 5.1025 6.4853 6.9401 5.4342 3.8217 3.3072 1.3319 5.7561 1.2520 6.4044 1.6239 1.5211 7.5434 1.3563 1.3569 8.6524 1.3377 8.8476 1.3304 2.5363 2.0333 2.2863 1.3578 1.2590 1.2595 1.4375 1.3118 1.3678 1.1692 1.7176 3.1041 3.1032 4.5558 1.6997 1.3328 7.3607 6.4114 10.0547 1.9075 1.7854 1.6495 1.5293 1.5279 1.0502 1.0498 1.1356 1.3671 2.1665 7.7453 7.3660 5.9024 6.2754 1.0328 1.0326 1.1039 1.1041 1.0992 1.0998 1.0858 1.0887 1.0885 1.0882 1.0942 1.0959 1.0975 1.0973
irintensity: 1.4418 1.3513 1.6227 0.0731 8.4645 4.5610 1.8451 0.3520 2.8394 1.1810 0.2995 1.3894 0.5012 3.0931 0.6362 0.1204 10.8952 0.0440 18.7091 0.2803 39.9481 20.0346 23.9109 8.1825 4.6165 0.8925 0.4530 4.0948 0.8942 23.7888 73.3362 10.7908 0.9073 1.2778 82.3870 2.9466 0.3910 3.3228 0.8690 40.2913 1.2499 64.2406 0.9582 9.9389 10.8650 8.9490 40.5889 0.2177 0.1826 81.2694 43.4163 31.5561 28.8238 54.3886 180.3347 125.6139 293.8244 31.0691 0.3027 30.0637 25.6859 32.4030 16.9982 6.2817 23.9577 1.0061 111.6250 14.0795 12.9684 109.0470 3.1110 60.2940 4.2493 30.1717 31.3805 271.0995 95.4200 89.9566 46.5086 45.9660 17.3974 29.4522 1.1633 24.2408 0.2701 1.4042 16.3041 12.9478 43.4740 7.9337
temp: 298.150 k
press: 1.00000 atm
elementType: 8 8 7 7 6 6 6 6 6 6 6 6 6 6 6 6 6 6 1 1 1 1 1 1 1 1 1 1 1 1 1 1
symmnumber: 1
zpe: 654979.0 jmol-1
zpe.correction: 0.249468 hartree
zpe.thermalcorrener: 0.265920 hartree
zpe.thermalcorrenthalpy: 0.266864 hartree
zpe.thermalcorrgfe: 0.204102 hartree
zpe.sumelectzpe: -800.473968 hartree
zpe.sumelectthermal: -800.457516 hartree
zpe.sumelectthermalent: -800.456572 hartree
zpe.sumelectthermalfe: -800.519334 hartree
dipole: -0.5927 3.0795 0.0355
dipole: 3.1362
quadrupole: -71.6656 -87.8973 -110.4965
quadrupole: 3.9327 0.1754 0.0396
quadrupole: 18.3542 2.1225 -20.4767 3.9327 0.1754 0.0396
hfenergy: -800.7234359 hartree
pointgroup: C01 [X(C14H14N2O2)]
dipole: -0.176894 -1.2210639 0.0144132 debye
polarizability: 422.7217363|-0.1194234|187.4248994|-12.9394324|-1.6913198|77.2005287 unknown
InChI: InChI=1S/C14H14N2O2/c1-17-12-9-7-11(8-10-12)15-16-13-5-3-4-6-14(13)18-2/h3-10H,1-2H3
charge 0 multiplicity 1
32 atoms
O  -2.547205 -2.144677 0.150364
O  5.576359 0.175744 -0.210594
N  -0.801681 -0.076081 0.036208
N  -0.01035 0.971676 -0.002283
C  -2.191525 0.240053 0.081308
C  -3.106461 -0.866604 0.139327
C  1.379366 0.655506 -0.052472
C  4.180662 0.260511 -0.157553
C  -2.715142 1.563343 0.069088
C  2.265321 1.769322 -0.089415
C  1.91788 -0.662287 -0.068767
C  -4.503886 -0.622052 0.182489
C  3.653736 1.578469 -0.141271
C  3.307596 -0.86308 -0.121037
C  -4.100037 1.798394 0.112214
C  -4.993311 0.701069 0.168909
C  -3.462581 -3.288285 0.213059
C  6.182165 -1.159604 -0.232093
H  -1.994272 2.385673 0.024096
H  1.833258 2.7752 -0.076463
H  1.221335 -1.506187 -0.03975
H  -5.211733 -1.454454 0.226165
H  4.349307 2.42214 -0.17026
H  3.704839 -1.882684 -0.13315
H  -4.487381 2.822577 0.101226
H  -6.075009 0.873494 0.202354
H  -4.131193 -3.320024 -0.669138
H  -4.068443 -3.271423 1.139864
H  -2.807997 -4.171922 0.214129
H  5.86151 -1.731346 -1.124084
H  5.933723 -1.727961 0.684798
H  7.266248 -0.980403 -0.275666
