program: Orca
programVersion: 5.0.2
elementType: O O C C C C C C C C C C C C C C C C C C C C C H H H H H H H H H H H H H H H H H H H H H H H H H H H H H H Ag
elementType: Ag
charge: 1
multiplicity: 1
keywords: DLPNO-CCSD(T) def2-TZVPP def2-TZVPP/C VeryTightSCF
formula: C21H30O2Ag
InChI: InChI=1S/C21H30O2.Ag/c1-5-6-7-10-17-14-19(22)18-11-13-21(4,23-20(18)15-17)12-8-9-16(2)3;/h9,11,13-15,22H,5-8,10,12H2,1-4H3;
54 atoms
O  2.145042 -0.46426 -1.416384
O  0.936378 -3.38341 2.085286
C  3.403984 -0.051676 -0.811318
C  3.294002 1.429815 -0.41134
C  3.766243 -0.914117 0.365708
C  1.249649 -1.211277 -0.763419
C  4.436436 -0.207656 -1.920279
C  2.287173 1.803028 0.687828
C  1.57126 -1.905069 0.400942
C  -1.020042 -2.105571 -0.719584
C  2.924298 -1.7725 0.9261
C  -2.405146 -2.188996 -1.308141
C  -0.045056 -1.286653 -1.325137
C  -3.507881 -1.645601 -0.388274
C  0.586987 -2.713495 0.974929
C  -0.693655 -2.805875 0.428217
C  -3.297954 -0.205027 0.068417
C  0.977582 2.382042 0.198818
C  -4.476166 0.405925 0.828682
C  -0.111283 2.678687 0.971195
C  -5.708676 0.646296 -0.033797
C  -1.173406 3.632592 0.481089
C  -0.169729 2.350975 2.439791
H  4.291674 1.725189 -0.081928
H  3.094238 2.00695 -1.317664
H  4.776603 -0.801294 0.739418
H  4.514622 -1.252288 -2.216867
H  4.148252 0.382379 -2.789907
H  5.415301 0.129478 -1.580123
H  2.7414 2.581681 1.30813
H  2.133563 0.960131 1.365099
H  3.219238 -2.385528 1.765899
H  -2.424444 -1.643719 -2.254111
H  -2.627088 -3.230925 -1.546204
H  -0.198203 -0.892182 -2.324521
H  -3.606957 -2.283542 0.493691
H  -4.453384 -1.722196 -0.926583
H  -1.432068 -3.439229 0.906683
H  -2.426441 -0.182852 0.747981
H  -3.07835 0.426736 -0.806966
H  1.008063 2.830305 -0.792878
H  -4.156307 1.354357 1.268307
H  -4.729628 -0.245089 1.669734
H  -6.495176 1.131222 0.543276
H  -5.475995 1.29211 -0.883095
H  -6.122729 -0.282891 -0.425628
H  0.220578 -3.945787 2.385451
H  -1.050052 4.589095 0.995099
H  -1.103649 3.818466 -0.590022
H  -2.179057 3.281167 0.715829
H  -1.188935 2.129156 2.756781
H  0.474134 1.519663 2.720433
H  0.154502 3.226147 3.009595
Ag -0.553437 0.689478 -0.219011
totalener: -1108.70600724 hartree
nucrepener: 2498.00075274 hartree
electener: -3606.70675998 hartree
oneelecener: -6517.87026219 hartree
twoeener: 2911.16350220 hartree
kineticenergy: 1018.58970217 hartree
chargesum: 1.0000000
charge: -0.398871 -0.376109 0.503034 -0.204036 -0.209430 0.036561 -0.229402 -0.103267 0.201025 -0.139627 -0.257126 -0.166040 -0.007656 -0.105466 0.208017 -0.101462 -0.016241 -0.251922 -0.056766 0.149223 -0.195202 -0.168502 -0.214679 0.103984 0.075523 0.111217 0.094426 0.085687 0.076916 0.115741 0.072628 0.138309 0.083996 0.117742 0.203624 0.062940 0.089020 0.085926 -0.031237 0.022009 0.139178 0.038344 0.055812 0.084938 0.053069 0.061104 0.234118 0.110346 0.077438 0.066509 0.084815 0.082613 0.115134 0.392076
charge: 0.284579 0.351314 -0.194196 0.012065 0.016890 -0.150284 0.047047 -0.001390 -0.090739 -0.034169 0.009138 0.015326 -0.048032 0.001469 -0.130190 -0.030877 -0.011776 -0.005582 -0.022170 -0.091026 0.021629 0.042770 0.045784 0.032943 0.026765 0.027920 0.020573 0.017816 0.019576 0.034131 0.027175 0.031456 0.030333 0.034542 0.037602 0.019501 0.023844 0.019009 0.020793 0.025489 0.033472 0.009767 0.018718 0.012590 0.006746 0.005579 -0.095096 0.030485 0.023880 0.018642 0.022763 0.021121 0.031965 0.372320
qa: -0.3989 -0.3761 0.5030 -0.2040 -0.2094 0.0366 -0.2294 -0.1033 0.2010 -0.1396 -0.2571 -0.1660 -0.0077 -0.1055 0.2080 -0.1015 -0.0162 -0.2519 -0.0568 0.1492 -0.1952 -0.1685 -0.2147 0.1040 0.0755 0.1112 0.0944 0.0857 0.0769 0.1157 0.0726 0.1383 0.0840 0.1177 0.2036 0.0629 0.0890 0.0859 -0.0312 0.0220 0.1392 0.0383 0.0558 0.0849 0.0531 0.0611 0.2341 0.1103 0.0774 0.0665 0.0848 0.0826 0.1151 0.3921
va: 1.9927 2.0833 3.6843 3.9289 3.9339 4.0998 3.9524 3.9272 3.3723 3.8830 4.0451 3.9083 3.5385 3.8785 3.9893 3.8314 3.8610 3.8058 3.9012 3.6167 3.9700 3.9391 3.9586 1.0146 1.0219 1.0165 1.0137 1.0092 1.0096 1.0005 1.0167 1.0172 1.0170 1.0051 0.9977 1.0204 1.0152 1.0155 1.0229 1.0165 1.0220 1.0089 1.0150 1.0079 1.0040 1.0051 1.0123 1.0004 1.0074 1.0055 1.0067 0.9999 1.0003 1.2565
e0: -1108.706007239 hartree
corrType: DLPNO BASED
energy: -1113.635834156783
dipole: 20.60411 -21.17638 -0.57227 -36.93007 37.64989 0.71982 19.45577 -18.87274 0.58303
magnitude: 1.08883 au
magnitude: 2.76760 debye
