program: Orca
programVersion: 5.0.2
elementType: O O C C C C C C C C C C C C C C C C C C C C C H H H H H H H H H H H H H H H H H H H H H H H H H H H H H H Ag
elementType: Ag
charge: 1
multiplicity: 1
keywords: DLPNO-CCSD(T) def2-TZVPP def2-TZVPP/C VeryTightSCF
formula: C21H30O2Ag
InChI: InChI=1S/C21H30O2.Ag/c1-5-6-7-10-17-14-19(22)18-11-13-21(4,23-20(18)15-17)12-8-9-16(2)3;/h9,11,13-15,22H,5-8,10,12H2,1-4H3;
54 atoms
O  2.132528 -0.482699 -1.337636
O  1.111039 -3.470022 2.165444
C  3.43885 -0.11456 -0.808645
C  3.38381 1.34178 -0.310571
C  3.879842 -1.055156 0.277994
C  1.264435 -1.216142 -0.633985
C  4.376097 -0.207358 -2.005623
C  2.509682 1.656582 0.915269
C  1.659254 -1.966673 0.473295
C  -1.028529 -2.024753 -0.414448
C  3.060095 -1.912522 0.87237
C  -2.463954 -1.999056 -0.861054
C  -0.074992 -1.224368 -1.084469
C  -3.229058 -0.819256 -0.249291
C  0.696291 -2.750969 1.110175
C  -0.633058 -2.77095 0.679423
C  -4.692569 -0.749963 -0.661911
C  1.186656 2.326434 0.616977
C  -5.423066 0.44431 -0.058695
C  0.171115 2.546654 1.505997
C  -6.88807 0.510331 -0.467928
C  -0.897892 3.572855 1.221795
C  0.216609 2.039393 2.922985
H  4.414646 1.614349 -0.078631
H  3.091261 1.969793 -1.155854
H  4.924988 -0.999084 0.556755
H  5.38459 0.094767 -1.724675
H  4.411787 -1.230394 -2.376192
H  4.028908 0.443036 -2.808035
H  3.058743 2.360198 1.548534
H  2.384647 0.765216 1.533211
H  3.407316 -2.581884 1.646569
H  -2.511932 -1.938431 -1.950316
H  -2.953557 -2.930244 -0.572081
H  -0.293452 -0.804371 -2.061349
H  -2.73782 0.121029 -0.555091
H  -3.157013 -0.872677 0.84257
H  -1.356168 -3.383867 1.205327
H  -4.76048 -0.708596 -1.753392
H  -5.193294 -1.674822 -0.359496
H  1.150342 2.893226 -0.312056
H  -4.916209 1.366636 -0.361911
H  -5.348309 0.398241 1.032335
H  -7.386337 1.37061 -0.021762
H  -6.991118 0.591785 -1.55134
H  -7.425313 -0.385132 -0.150995
H  0.401326 -4.014174 2.510579
H  -0.71107 4.453084 1.841975
H  -0.900632 3.892798 0.180563
H  -1.892729 3.212249 1.486006
H  -0.781355 1.805339 3.293281
H  0.852247 1.16475 3.047758
H  0.614314 2.829605 3.565733
Ag -0.387171 0.706333 0.116306
totalener: -1108.71059993 hartree
nucrepener: 2442.63679128 hartree
electener: -3551.34739122 hartree
oneelecener: -6407.33336005 hartree
twoeener: 2855.98596883 hartree
kineticenergy: 1018.57209443 hartree
chargesum: 1.0000000
charge: -0.398118 -0.375672 0.506113 -0.211046 -0.210949 0.081204 -0.227142 -0.096420 0.180507 -0.037619 -0.250073 -0.164997 -0.117071 -0.051500 0.226860 -0.113130 -0.120025 -0.251598 -0.020353 0.136131 -0.198288 -0.174717 -0.208080 0.104458 0.075353 0.111852 0.076360 0.095276 0.086104 0.117007 0.071549 0.137480 0.097122 0.096191 0.205753 -0.010137 0.070263 0.089145 0.051728 0.056649 0.143560 0.021902 0.034646 0.072930 0.057944 0.059481 0.235230 0.110119 0.077993 0.074730 0.087577 0.081750 0.115863 0.390107
charge: 0.284149 0.352220 -0.193884 0.013080 0.017807 -0.151118 0.047261 -0.001089 -0.090955 -0.033933 0.009610 0.016353 -0.049806 -0.010819 -0.129732 -0.028449 -0.016041 -0.007617 -0.033056 -0.089403 0.019227 0.042908 0.046293 0.033122 0.026894 0.028014 0.019443 0.020876 0.018069 0.034490 0.027158 0.031651 0.032146 0.032530 0.039449 0.015922 0.021295 0.019693 0.018587 0.020131 0.033867 0.008029 0.010684 0.008338 0.007800 0.008511 -0.094400 0.030712 0.023434 0.020205 0.023558 0.020605 0.032322 0.413860
qa: -0.3981 -0.3757 0.5061 -0.2110 -0.2109 0.0812 -0.2271 -0.0964 0.1805 -0.0376 -0.2501 -0.1650 -0.1171 -0.0515 0.2269 -0.1131 -0.1200 -0.2516 -0.0204 0.1361 -0.1983 -0.1747 -0.2081 0.1045 0.0754 0.1119 0.0764 0.0953 0.0861 0.1170 0.0715 0.1375 0.0971 0.0962 0.2058 -0.0101 0.0703 0.0891 0.0517 0.0566 0.1436 0.0219 0.0346 0.0729 0.0579 0.0595 0.2352 0.1101 0.0780 0.0747 0.0876 0.0818 0.1159 0.3901
va: 1.9959 2.0851 3.6830 3.9344 3.9370 4.0264 3.9512 3.9110 3.3860 3.8608 4.0411 3.9260 3.6760 3.7778 3.9663 3.8482 3.9114 3.8003 3.8633 3.6297 3.9882 3.9415 3.9555 1.0139 1.0221 1.0162 1.0096 1.0138 1.0091 1.0008 1.0177 1.0171 1.0131 1.0125 1.0012 1.0232 1.0273 1.0175 1.0179 1.0193 1.0223 1.0132 1.0116 1.0070 1.0048 1.0055 1.0116 0.9999 1.0054 1.0060 1.0065 0.9982 1.0004 1.2471
e0: -1108.710599948 hartree
corrType: DLPNO BASED
energy: -1113.633723342261
dipole: 5.23568 -5.32153 -0.08585 -40.05955 40.79653 0.73698 4.59502 -3.77744 0.81759
magnitude: 1.10406 au
magnitude: 2.80631 debye
