program: Orca
programVersion: 5.0.2
elementType: O O C C C C C C C C C C C C C C C C C C C C C H H H H H H H H H H H H H H H H H H H H H H H H H H H H H H Ag
elementType: Ag
charge: 1
multiplicity: 1
keywords: DLPNO-CCSD(T) def2-TZVPP def2-TZVPP/C VeryTightSCF
formula: C21H30O2Ag
InChI: InChI=1S/C21H30O2.Ag/c1-5-6-7-10-17-14-19(22)18-11-13-21(4,23-20(18)15-17)12-8-9-16(2)3;/h9,11,13-15,22H,5-8,10,12H2,1-4H3;
54 atoms
O  1.993462 -0.277102 -1.211941
O  0.781414 -4.079671 1.2877
C  3.109802 0.013691 -0.325894
C  2.64059 0.907318 0.837364
C  3.631822 -1.272692 0.265349
C  1.070739 -1.160029 -0.795249
C  4.14187 0.685436 -1.211211
C  2.168301 2.335073 0.54372
C  1.412761 -2.17993 0.095221
C  -1.200041 -2.011474 -0.977333
C  2.808638 -2.286123 0.504064
C  -2.584103 -1.926716 -1.565913
C  -0.222583 -1.064585 -1.339698
C  -3.456552 -0.774406 -1.045815
C  0.423688 -3.100522 0.441267
C  -0.870851 -3.006211 -0.07733
C  -3.847954 -0.836749 0.432837
C  0.919854 2.511501 -0.281528
C  -2.822138 -0.286156 1.423206
C  -0.210241 3.182494 0.089188
C  -3.311164 -0.2730 2.866126
C  -1.212653 3.623379 -0.95037
C  -0.42629 3.772169 1.457588
H  1.863552 0.36675 1.390475
H  3.484711 0.973827 1.527331
H  4.682779 -1.319286 0.52078
H  4.495093 -0.01188 -1.968923
H  3.720422 1.552485 -1.718108
H  4.994318 1.011302 -0.615003
H  2.961447 2.878617 0.022815
H  2.051377 2.839554 1.502018
H  3.148323 -3.204808 0.960925
H  -2.494462 -1.827458 -2.649994
H  -3.105365 -2.868112 -1.38416
H  -0.378108 -0.409221 -2.191975
H  -4.367823 -0.768032 -1.645765
H  -2.967002 0.186274 -1.261667
H  -1.615069 -3.73946 0.212336
H  -4.774992 -0.275539 0.571176
H  -4.082295 -1.870004 0.705844
H  1.025198 2.276019 -1.338279
H  -2.606861 0.765146 1.13607
H  -1.898874 -0.878634 1.376757
H  -4.221886 0.318489 2.964276
H  -3.533937 -1.286194 3.202248
H  -2.563328 0.143657 3.540385
H  0.063838 -4.702298 1.414841
H  -1.044438 3.152191 -1.918346
H  -2.240967 3.438742 -0.635868
H  -1.121008 4.703842 -1.0870
H  -0.17291 4.835029 1.432293
H  -1.475266 3.707662 1.747391
H  0.173116 3.303015 2.233743
Ag -0.656118 0.798073 0.089405
totalener: -1108.70272350 hartree
nucrepener: 2526.37552346 hartree
electener: -3635.07824695 hartree
oneelecener: -6574.54382679 hartree
twoeener: 2939.46557984 hartree
kineticenergy: 1018.64408524 hartree
chargesum: 1.0000000
charge: -0.415006 -0.375807 0.580793 -0.202253 -0.211082 0.120109 -0.268878 -0.198077 0.104570 -0.099203 -0.180577 -0.186518 -0.123723 -0.026890 0.227106 -0.119190 -0.156982 -0.160019 0.069935 0.107003 -0.180050 -0.191633 -0.204706 0.039829 0.113216 0.115077 0.104055 0.075196 0.081477 0.099259 0.112096 0.133906 0.108662 0.092255 0.198258 0.106459 -0.017380 0.084635 0.090260 0.062273 0.143336 -0.074912 -0.011210 0.077326 0.074125 0.066631 0.235299 0.074314 0.071590 0.113012 0.116731 0.081121 0.075038 0.449143
charge: 0.273833 0.352019 -0.198147 0.006326 0.020718 -0.148571 0.045137 -0.002648 -0.086058 -0.038545 0.017445 0.013031 -0.044331 -0.000672 -0.131945 -0.030020 -0.005886 -0.003464 -0.016578 -0.080108 0.031808 0.041916 0.042693 0.026328 0.037484 0.024455 0.023743 0.012963 0.022298 0.032606 0.027920 0.031171 0.032951 0.030867 0.038272 0.026562 0.014996 0.017338 0.024420 0.022925 0.033296 0.022449 0.021090 0.013827 0.014612 0.008445 -0.095597 0.023027 0.019153 0.031315 0.031251 0.022165 0.016727 0.332983
qa: -0.4150 -0.3758 0.5808 -0.2023 -0.2111 0.1201 -0.2689 -0.1981 0.1046 -0.0992 -0.1806 -0.1865 -0.1237 -0.0269 0.2271 -0.1192 -0.1570 -0.1600 0.0699 0.1070 -0.1801 -0.1916 -0.2047 0.0398 0.1132 0.1151 0.1041 0.0752 0.0815 0.0993 0.1121 0.1339 0.1087 0.0923 0.1983 0.1065 -0.0174 0.0846 0.0903 0.0623 0.1433 -0.0749 -0.0112 0.0773 0.0741 0.0666 0.2353 0.0743 0.0716 0.1130 0.1167 0.0811 0.0750 0.4491
va: 1.9680 2.0876 3.5568 3.8800 3.9953 4.0328 3.9722 3.9989 3.5343 3.8634 4.0125 3.9263 3.6335 3.7962 3.9723 3.7901 3.9482 3.6951 3.8395 3.6298 3.9594 3.9370 3.9541 1.0230 1.0175 1.0140 1.0141 1.0014 1.0075 1.0056 0.9952 1.0147 1.0081 1.0113 1.0042 1.0072 1.0270 1.0196 1.0112 1.0212 1.0268 1.0196 1.0072 1.0074 1.0087 1.0104 1.0115 1.0074 1.0083 0.9996 0.9999 1.0061 1.0055 1.1142
e0: -1108.702723504 hartree
corrType: DLPNO BASED
energy: -1113.634519726155
dipole: 30.92015 -31.80032 -0.88017 -40.92395 41.75599 0.83204 3.76558 -3.33199 0.43359
magnitude: 1.28646 au
magnitude: 3.26993 debye
