program: Orca
programVersion: 5.0.2
elementType: O O C C C C C C C C C C C C C C C C C C C C C H H H H H H H H H H H H H H H H H H H H H H H H H H H H H H Ag
elementType: Ag
charge: 1
multiplicity: 1
keywords: wB97X-D3 Opt Freq def2-TZVPP def2/J RIJCOSX TightSCF defgrid3 CHELPG
frequency: 0.00 0.00 0.00 0.00 0.00 0.00 25.60 32.19 45.05 54.88 68.65 71.55 79.83 86.35 117.28 131.95 144.08 148.16 164.49 182.93 192.66 204.57 217.58 221.09 231.05 249.41 260.67 267.19 279.46 289.93 296.84 328.89 339.44 339.94 367.12 387.95 394.80 411.17 427.47 452.74 474.31 485.56 493.49 502.46 533.98 554.50 578.14 598.50 623.66 665.23 686.88 710.31 737.95 741.76 756.76 771.20 786.59 812.46 862.15 863.16 868.39 882.47 896.76 909.23 917.75 918.47 939.75 952.68 971.54 984.74 988.61 1008.35 1009.69 1021.93 1034.27 1042.64 1068.14 1089.69 1099.20 1102.21 1122.26 1132.55 1136.67 1144.49 1173.09 1178.76 1191.45 1204.49 1208.87 1219.40 1237.03 1249.15 1262.48 1285.44 1293.83 1295.02 1316.13 1331.13 1358.02 1365.88 1367.10 1369.58 1381.31 1392.08 1401.42 1407.36 1413.45 1417.39 1427.26 1431.22 1436.27 1443.51 1475.20 1476.38 1480.61 1486.32 1489.00 1489.78 1493.51 1495.43 1496.03 1498.80 1499.39 1504.18 1507.33 1515.18 1525.54 1541.44 1642.98 1656.75 1679.74 1736.36 2932.85 2971.03 3037.72 3045.82 3052.06 3055.77 3064.68 3071.49 3072.47 3076.60 3076.62 3096.51 3102.57 3104.16 3118.98 3120.91 3121.02 3128.40 3131.31 3138.22 3148.75 3154.59 3159.13 3164.90 3171.08 3174.22 3188.15 3220.43 3223.14 3899.96
frequency: 25.60 32.19 45.05 54.88 68.65 71.55 79.83 86.35 117.28 131.95 144.08 148.16 164.49 182.93 192.66 204.57 217.58 221.09 231.05 249.41 260.67 267.19 279.46 289.93 296.84 328.89 339.44 339.94 367.12 387.95 394.80 411.17 427.47 452.74 474.31 485.56 493.49 502.46 533.98 554.50 578.14 598.50 623.66 665.23 686.88 710.31 737.95 741.76 756.76 771.20 786.59 812.46 862.15 863.16 868.39 882.47 896.76 909.23 917.75 918.47 939.75 952.68 971.54 984.74 988.61 1008.35 1009.69 1021.93 1034.27 1042.64 1068.14 1089.69 1099.20 1102.21 1122.26 1132.55 1136.67 1144.49 1173.09 1178.76 1191.45 1204.49 1208.87 1219.40 1237.03 1249.15 1262.48 1285.44 1293.83 1295.02 1316.13 1331.13 1358.02 1365.88 1367.10 1369.58 1381.31 1392.08 1401.42 1407.36 1413.45 1417.39 1427.26 1431.22 1436.27 1443.51 1475.20 1476.38 1480.61 1486.32 1489.00 1489.78 1493.51 1495.43 1496.03 1498.80 1499.39 1504.18 1507.33 1515.18 1525.54 1541.44 1642.98 1656.75 1679.74 1736.36 2932.85 2971.03 3037.72 3045.82 3052.06 3055.77 3064.68 3071.49 3072.47 3076.60 3076.62 3096.51 3102.57 3104.16 3118.98 3120.91 3121.02 3128.40 3131.31 3138.22 3148.75 3154.59 3159.13 3164.90 3171.08 3174.22 3188.15 3220.43 3223.14 3899.96
formula: C21H30O2Ag
InChI: InChI=1S/C21H30O2.Ag/c1-5-6-7-10-17-14-19(22)18-11-13-21(4,23-20(18)15-17)12-8-9-16(2)3;/h9,11,13-15,22H,5-8,10,12H2,1-4H3;
54 atoms
O  1.963712 -0.252355 -1.247668
O  0.750913 -4.065209 1.370672
C  3.115455 0.056588 -0.419545
C  2.697003 0.941854 0.769599
C  3.684853 -1.225726 0.135658
C  1.066956 -1.137445 -0.775182
C  4.093608 0.742506 -1.354187
C  2.200583 2.367749 0.504909
C  1.460419 -2.154924 0.100696
C  -1.212697 -1.987108 -0.81748
C  2.88329 -2.246348 0.414573
C  -2.618547 -1.897372 -1.355132
C  -0.251774 -1.043634 -1.241899
C  -3.414398 -0.649797 -0.926594
C  0.484416 -3.06239 0.52005
C  -0.835279 -2.972227 0.068823
C  -4.259407 -0.790306 0.340448
C  0.905982 2.540893 -0.247706
C  -3.559053 -1.181988 1.641655
C  -0.204063 3.205483 0.189957
C  -2.445183 -0.24389 2.101423
C  -1.268646 3.641545 -0.787727
C  -0.342033 3.791212 1.57011
H  1.951917 0.393757 1.357889
H  3.573961 1.013709 1.416886
H  4.751554 -1.273025 0.313201
H  4.417556 0.051154 -2.130226
H  3.633965 1.603435 -1.837431
H  4.970286 1.080633 -0.801475
H  2.961101 2.916514 -0.057343
H  2.135581 2.869232 1.469646
H  3.297481 -3.166078 0.811554
H  -2.552405 -1.908776 -2.445212
H  -3.172208 -2.794267 -1.072805
H  -0.453036 -0.389705 -2.085365
H  -4.09315 -0.377834 -1.736351
H  -2.734137 0.211947 -0.844972
H  -1.54356 -3.711114 0.41894
H  -4.784945 0.156293 0.498303
H  -5.038849 -1.530446 0.143224
H  0.951489 2.308632 -1.30948
H  -3.16227 -2.19643 1.571189
H  -4.321643 -1.217326 2.421281
H  -1.485637 -0.540279 1.641775
H  -2.684167 0.804605 1.888343
H  -2.268164 -0.314428 3.173763
H  1.662411 -4.045246 1.665702
H  -1.151921 3.176995 -1.766345
H  -2.275043 3.444207 -0.415399
H  -1.196516 4.723705 -0.922615
H  0.296097 3.31604 2.310948
H  -0.084713 4.852874 1.534746
H  -1.373859 3.731268 1.916444
Ag -0.623743 0.817945 0.213586
totalener: -1115.66102865 hartree
nucrepener: 2535.30687353 hartree
electener: -3650.96790218 hartree
oneelecener: -6594.41344889 hartree
twoeener: 2943.44554671 hartree
kineticenergy: 1020.41964211 hartree
xcener: -106.933436656814 hartree
chargesum: 1.0000000
charge: -0.312477 -0.256266 0.408794 -0.199792 -0.241324 0.070597 -0.291272 -0.281793 -0.011300 -0.096135 -0.096847 -0.180029 -0.087938 -0.078004 0.215903 -0.124919 -0.190810 -0.127126 -0.123678 0.105833 -0.169734 -0.208980 -0.245381 0.079908 0.124070 0.137176 0.123035 0.096305 0.103937 0.121463 0.118641 0.115384 0.124925 0.101707 0.235757 0.113526 0.014367 0.131189 0.089531 0.093354 0.175488 0.085129 0.105601 0.010551 0.070379 0.124751 0.198942 0.096306 0.097037 0.130128 0.096473 0.135972 0.100885 0.170760
charge: 0.330550 0.397758 -0.229470 -0.001649 0.025906 -0.183285 0.033730 -0.010523 -0.094081 -0.057619 -0.004651 0.009681 -0.046894 -0.006697 -0.166823 -0.002808 -0.028018 -0.016937 -0.027518 -0.097540 0.038919 0.032962 0.033608 0.033862 0.044320 0.030441 0.029601 0.019189 0.028875 0.039674 0.034009 0.024425 0.039130 0.038355 0.046149 0.032064 0.015324 0.032173 0.026713 0.031104 0.038822 0.021630 0.029807 0.015877 0.024547 0.027950 -0.106400 0.029113 0.027075 0.037729 0.022127 0.037915 0.029526 0.290271
qa: -0.3125 -0.2563 0.4088 -0.1998 -0.2413 0.0706 -0.2913 -0.2818 -0.0113 -0.0961 -0.0968 -0.1800 -0.0879 -0.0780 0.2159 -0.1249 -0.1908 -0.1271 -0.1237 0.1058 -0.1697 -0.2090 -0.2454 0.0799 0.1241 0.1372 0.1230 0.0963 0.1039 0.1215 0.1186 0.1154 0.1249 0.1017 0.2358 0.1135 0.0144 0.1312 0.0895 0.0934 0.1755 0.0851 0.1056 0.0106 0.0704 0.1248 0.1989 0.0963 0.0970 0.1301 0.0965 0.1360 0.1009 0.1708
va: 2.1526 2.2586 3.7310 3.8002 4.0261 4.0103 3.9521 4.0726 3.5727 3.7305 3.9705 3.9256 3.6130 3.7987 4.0561 3.8863 3.9387 3.6834 3.8807 3.6692 3.9107 3.9028 3.9564 1.0193 1.0145 1.0083 1.0109 1.0022 1.0026 0.9988 1.0030 1.0155 1.0032 1.0069 0.9957 1.0054 1.0105 1.0154 1.0095 1.0125 1.0248 1.0089 1.0085 0.9974 1.0111 1.0062 1.0471 1.0088 1.0071 0.9972 1.0082 0.9948 1.0053 1.5894
dispcorr: -0.033914765 hartree
energy: -1115.703950232763
dipole: 31.32083 -31.15023 0.17060 -42.25966 43.50749 1.24783 -4.04881 4.61413 0.56532
magnitude: 1.38050 au
magnitude: 3.50894 debye
temp: 298.15 k
press: 1.00 atm
zeropoint: 0.47104782 hartree
thermalvibcorrection: 0.02291149 hartree
thermalrotcorrection: 0.00141627 hartree
thermaltrasncorrection: 0.00141627 hartree
thermaltotal: -1115.20715838 hartree
thermalcorr: 0.02574403 hartree
nonthermalcorr: 0.47104782 hartree
totalcorr: 0.49679186 hartree
thermalcorrenthalpy: 0.00094421 hartree
totalenthalpy: -1115.20621417 hartree
totalentropycorr: -0.07785533 hartree
gibbsenthalpy: -1115.28406950 hartree
gibbsminuselec: 0.41988074 hartree
