program: Gaussian 09
title: 000005335
version: EM64L-G09RevD.01
frameworkgroup: C1[X(C15H14N4O2S)]
method: RPBEPBE
basis: SDD
operation: Freq
keyword: #p
keyword: freq=noraman
keyword: PBEPBE/SDD
title: #p freq=noraman PBEPBE/SDD
converged: YES YES NO NO
title: Mulliken charges:
elementType: S O O N N N N C C C C C C C C C C C C C C C H H H H H H H H H H H H H H
charge: 0.888652 -0.542969 -0.516211 -0.254683 -0.473950 -0.039069 -0.686788 0.263028 -0.134249 0.411081 -0.353062 -0.211409 -0.172089 -0.274973 -0.391027 -0.404857 -0.333493 -0.379151 0.513132 -0.221116 -0.207882 -0.254607 0.304268 0.264197 0.282406 0.289685 0.260413 0.231069 0.233344 0.311832 0.284814 0.224284 0.229386 0.228838 0.315751 0.315404
chargesum: 0.00000
title: Mulliken charges with hydrogens summed into heavy atoms:
elementType: S O O N N N N C C C C C C C C C C C C C C C
charge: 0.888652 -0.542969 -0.516211 -0.254683 -0.169682 -0.039069 -0.055634 0.263028 -0.134249 0.411081 -0.088865 0.070997 0.117596 -0.014559 -0.159958 -0.171512 -0.021661 -0.094338 0.513132 0.003168 0.021504 -0.025769
polarizability: 3.64809485e+02 -2.76596222e+01 2.69661400e+02 2.14494204e+01 2.13512344e+01 1.35555643e+02
1716.lowfreq: -6.2867 -5.3651 -2.5481 -0.0002 0.0006 0.0012 10.4990 24.5527 29.2749
frequency: 8.6673 23.9580 29.0917 50.9696 64.7916 74.6821 111.5291 122.4100 127.2842 151.9188 168.8403 189.0237 225.5118 269.7088 285.5329 304.7254 326.5368 364.2669 370.6626 400.4966 406.3042 410.5632 413.4797 418.0975 425.7720 440.7275 488.6489 522.3803 526.7512 602.3624 612.9385 621.7670 626.5915 662.9505 686.8912 696.8148 717.8816 721.6410 768.9600 787.5693 795.2179 808.2867 814.9532 833.9702 853.9608 867.3790 875.7629 891.3635 934.4087 936.3505 955.8446 967.0273 980.5901 984.8382 989.0318 996.3999 1006.2428 1022.3198 1034.5614 1048.8667 1058.2036 1066.5871 1099.4927 1131.4750 1143.8416 1171.2742 1184.2185 1186.4479 1211.8301 1279.5366 1299.7447 1313.5898 1322.4238 1323.0223 1382.2363 1385.4723 1398.4562 1426.6270 1434.8904 1444.9623 1483.0367 1486.4004 1487.7703 1582.3083 1594.1015 1610.0050 1612.9723 1648.6608 3128.5838 3134.0092 3137.0212 3141.9872 3160.0430 3163.0793 3167.4862 3182.9553 3188.8446 3221.1666 3243.1213 3347.5651 3561.7021 3700.8348
redmass: 5.9487 5.6204 4.6901 5.1857 4.5444 8.3643 5.4704 5.2736 7.0220 9.7545 6.0395 6.3990 8.6027 5.3343 6.5371 5.9675 5.1536 8.3981 5.9842 3.2145 2.9427 1.0266 2.9165 4.9945 2.5673 2.2788 3.6521 2.7717 3.3823 6.9360 6.4013 6.8928 4.3693 7.6976 4.1247 2.2829 2.9288 4.8934 1.6297 11.2636 1.4077 4.8920 1.2630 1.8541 1.2500 1.7468 1.4494 4.3873 1.4301 4.0856 1.3466 1.3670 4.8891 1.6089 3.3770 1.3306 6.1074 1.4324 2.0542 2.5483 1.4682 2.1805 1.7729 1.2101 1.7501 1.0504 1.1161 1.1247 2.2470 2.9683 1.2993 3.3789 2.4399 1.4066 3.5911 8.9368 5.4033 3.3955 3.8099 2.5225 3.6457 3.0736 2.9765 7.3030 6.7887 6.0356 4.9391 1.2161 1.0854 1.0892 1.0892 1.0908 1.0972 1.0954 1.0963 1.0951 1.0958 1.0921 1.1061 1.0751 1.0453 1.1040
irintensity: 1.8925 0.4047 0.4811 1.7465 0.9203 1.4930 2.5856 2.0300 3.9339 10.0805 4.7620 4.3923 9.3093 3.5125 13.0195 0.1337 6.3392 8.9608 3.1545 10.5548 0.2692 1.1750 0.0687 30.7788 105.4011 320.8141 2.8752 26.8652 4.0516 20.0096 0.4629 0.5554 4.5562 28.6313 28.4303 26.2904 2.6636 3.0532 52.3011 68.9490 84.3367 11.6004 0.6249 75.9513 1.6545 108.5857 8.3433 14.8876 12.3491 18.8827 1.9712 0.2763 6.1242 0.8769 0.0828 3.1786 13.8171 0.6394 3.1994 63.0361 18.3719 36.7579 12.8662 15.8092 8.8930 0.3526 59.0789 3.5896 30.1489 24.7768 4.1420 34.0312 76.0982 7.9670 45.8476 5.3270 4.1913 18.4951 1.3320 7.5628 22.4450 50.7626 94.5381 6.8784 2.3059 15.9997 219.4758 290.1079 0.3279 14.4452 12.6181 21.3949 25.7120 6.0649 8.5541 4.0129 4.0402 3.9828 3.0042 16.4679 140.2986 24.9836
temp: 298.150 k
press: 1.00000 atm
elementType: 16 8 8 7 7 7 7 6 6 6 6 6 6 6 6 6 6 6 6 6 6 6 1 1 1 1 1 1 1 1 1 1 1 1 1 1
symmnumber: 1
zpe: 700264.4 jmol-1
zpe.correction: 0.266717 hartree
zpe.thermalcorrener: 0.286870 hartree
zpe.thermalcorrenthalpy: 0.287814 hartree
zpe.thermalcorrgfe: 0.215052 hartree
zpe.sumelectzpe: -1345.766942 hartree
zpe.sumelectthermal: -1345.746788 hartree
zpe.sumelectthermalent: -1345.745844 hartree
zpe.sumelectthermalfe: -1345.818607 hartree
dipole: -5.8383 4.2158 -2.8065
dipole: 7.7288
quadrupole: -97.8114 -131.7250 -140.7882
quadrupole: -18.8928 4.9762 13.2117
quadrupole: 25.6301 -8.2835 -17.3466 -18.8928 4.9762 13.2117
hfenergy: -1346.0336585 hartree
pointgroup: C01 [X(C15H14N4O2S1)]
dipole: -2.3298897 1.6236683 -1.0869361 debye
polarizability: 365.7938675|-25.832093|267.0175623|22.5866014|25.0415675|137.2150987 unknown
InChI: InChI=1S/C9H8N3.C6H6NO2S/c10-9-6-7-11-12(9)8-4-2-1-3-5-8;7-5-1-3-6(4-2-5)10(8)9/h1-7,10H;1-4H,7H2
charge 0 multiplicity 1
36 atoms
S  -0.374217 -2.09596 0.386085
O  -0.735698 -3.659631 0.042847
O  0.362417 -1.654602 1.775927
N  2.631887 0.031641 -0.21535
N  0.961079 -1.480375 -1.197385
N  3.93967 0.001701 0.252449
N  -5.498142 1.074472 -0.168884
C  2.225545 -1.240247 -0.682676
C  -1.936561 -1.105652 0.201005
C  1.916157 1.276215 -0.149762
C  3.34516 -2.09774 -0.497518
C  -2.995237 -1.663254 -0.5411
C  -2.022336 0.156404 0.818882
C  4.359983 -1.28955 0.061925
C  -4.188356 -0.932026 -0.662288
C  -3.218007 0.882294 0.695472
C  0.780918 1.515827 -0.963031
C  2.398928 2.282807 0.724508
C  -4.317596 0.352502 -0.048681
C  0.131397 2.766908 -0.88951
C  1.738819 3.526318 0.784439
C  0.602023 3.777336 -0.02032
H  0.937483 -2.401455 -1.680143
H  3.379223 -3.160382 -0.729142
H  -2.891742 -2.659011 -0.983867
H  -1.180224 0.551666 1.395167
H  5.373897 -1.559566 0.350406
H  -5.028742 -1.353079 -1.225968
H  -3.30675 1.863027 1.176376
H  0.417585 0.731412 -1.630252
H  3.282528 2.076536 1.332513
H  -0.744806 2.948585 -1.521774
H  2.114603 4.300723 1.462091
H  0.094892 4.747192 0.027642
H  -5.604512 1.980095 0.279513
H  -6.289071 0.700768 -0.685897
