program: Gaussian 09
title: 000034559
version: EM64L-G09RevD.01
frameworkgroup: C1[X(C14H14N2O)]
method: RPBEPBE
basis: SDD
operation: Freq
keyword: #p
keyword: freq=noraman
keyword: PBEPBE/SDD
title: #p freq=noraman PBEPBE/SDD
converged: YES YES NO NO
title: Mulliken charges:
elementType: O N N C C C C C C C C C C C C C C H H H H H H H H H H H H H H
charge: -0.266558 -0.128148 -0.112682 0.443039 0.165941 0.048634 -0.352230 -0.377170 0.230921 -0.290610 -0.346842 -0.805374 -0.270797 -0.334542 -0.234403 -0.209393 -0.501254 0.229577 0.233301 0.255615 0.248936 0.277170 0.226955 0.227814 0.238526 0.254733 0.229228 0.231127 0.219626 0.234604 0.234257
chargesum: 0.00000
title: Mulliken charges with hydrogens summed into heavy atoms:
elementType: O N N C C C C C C C C C C C C C C
charge: -0.266558 -0.128148 -0.112682 0.443039 0.165941 0.048634 -0.122653 -0.143869 0.230921 -0.034996 -0.097906 -0.112079 0.006373 -0.079810 -0.005174 0.021734 0.187233
polarizability: 3.85531954e+02 4.86703126e+00 1.81643751e+02 6.71973779e-01 1.92625852e-01 7.41182247e+01
1716.lowfreq: -1.8638 0.0003 0.0004 0.0004 4.0265 7.1887 26.4832 35.4891 44.4729
frequency: 26.0264 35.4632 44.4655 62.1519 65.0068 119.2613 180.1936 187.1438 189.4338 208.9367 253.3968 287.0864 292.8121 337.4794 357.4486 414.1185 422.3190 476.3236 478.7906 516.7704 518.6527 548.2670 580.7680 615.3161 634.2497 717.3081 720.3774 737.0351 772.3197 780.1487 832.0101 840.4223 846.1560 869.3903 895.0484 966.6166 970.1112 975.4668 983.3671 985.4357 989.8171 1001.6884 1033.2083 1044.5722 1090.2632 1112.8939 1113.0779 1147.3988 1150.7928 1161.2522 1182.8575 1215.3510 1220.7967 1238.0313 1264.4563 1297.3330 1343.6554 1372.7152 1395.8699 1396.2099 1416.1451 1423.7494 1439.6331 1446.7004 1450.8816 1467.3162 1469.8823 1472.5776 1487.3879 1565.9979 1574.0086 1606.4309 1612.5541 2973.8300 2991.4512 3054.7185 3086.5778 3097.9503 3118.2881 3120.8048 3128.1331 3134.7612 3150.6615 3159.4780 3166.4679 3168.2506 3175.4892
redmass: 3.6191 1.0444 3.8206 4.6047 3.4905 4.4522 3.0874 4.6322 4.6096 5.5329 1.3286 3.2239 4.8901 2.8859 4.3625 2.9975 5.5657 3.0065 6.7765 4.3122 3.9710 3.2167 5.6524 6.2715 6.9420 3.9917 4.0451 3.4783 1.2891 5.0255 6.2752 1.5119 1.2488 1.4571 7.4232 1.3432 1.3463 8.5119 1.3744 1.4000 1.3140 2.6647 1.9924 1.5715 2.2834 1.2640 1.2462 1.6022 1.3706 1.1312 1.6116 2.9557 2.5771 3.6347 1.8822 1.3492 7.1759 4.9987 7.2786 1.2339 3.4763 1.9502 1.6441 1.0561 1.0770 1.8103 1.1507 1.0684 2.5723 7.0371 6.2596 6.1855 6.3767 1.0391 1.0282 1.0943 1.0998 1.1042 1.1056 1.0896 1.0888 1.0857 1.0899 1.0955 1.0944 1.0936 1.0995
irintensity: 0.1886 0.5266 0.1777 0.7909 8.7764 2.0164 0.7873 0.9002 0.1201 1.2847 0.0025 4.9152 0.0518 1.4926 5.1629 0.4649 0.0137 0.0153 4.7772 19.9159 18.2315 12.0733 13.6407 4.5170 2.2313 3.9552 3.9424 12.7788 81.4656 1.6070 2.7654 55.8882 0.8767 0.0654 1.1110 1.6266 5.7881 22.4203 0.4714 1.3296 0.3397 5.4384 13.2455 26.6238 11.4333 20.6436 0.9789 0.8448 16.2335 56.5502 24.8837 140.2195 0.7493 29.4571 42.1591 0.6083 8.9167 2.5225 19.2022 8.1117 8.7059 24.4228 11.8221 13.3948 41.4750 67.7671 2.8461 12.1503 26.6537 54.7972 10.4736 21.0746 57.7486 39.7356 43.5529 23.5220 17.5992 31.0090 50.1470 22.5595 26.1063 3.0227 11.6941 14.9274 9.7194 6.4143 34.1852
temp: 298.150 k
press: 1.00000 atm
elementType: 8 7 7 6 6 6 6 6 6 6 6 6 6 6 6 6 6 1 1 1 1 1 1 1 1 1 1 1 1 1 1
symmnumber: 1
zpe: 642846.0 jmol-1
zpe.correction: 0.244847 hartree
zpe.thermalcorrener: 0.260570 hartree
zpe.thermalcorrenthalpy: 0.261514 hartree
zpe.thermalcorrgfe: 0.199817 hartree
zpe.sumelectzpe: -725.352036 hartree
zpe.sumelectthermal: -725.336313 hartree
zpe.sumelectthermalent: -725.335368 hartree
zpe.sumelectthermalfe: -725.397066 hartree
dipole: 1.8879 0.6489 0.0428
dipole: 1.9968
quadrupole: -79.9864 -88.7936 -105.1348
quadrupole: 4.4546 0.3823 -0.0021
quadrupole: 11.3185 2.5113 -13.8298 4.4546 0.3823 -0.0021
hfenergy: -725.5968827 hartree
pointgroup: C01 [X(C14H14N2O1)]
dipole: -0.7472715 -0.2419468 -0.0146411 debye
polarizability: 385.471124|0.9579427|181.2697207|7.3290693|5.34216|74.5530859 unknown
InChI: InChI=1S/C14H14N2O/c1-11-7-9-12(10-8-11)15-16-13-5-3-4-6-14(13)17-2/h3-10H,1-2H3
charge 0 multiplicity 1
31 atoms
O  2.849671 -2.214524 -0.155019
N  -0.168959 0.843514 -0.077638
N  0.671219 -0.165416 -0.106545
C  -4.363177 -0.013051 -0.236836
C  -1.547852 0.471529 -0.132932
C  2.046801 0.200588 -0.051881
C  -3.431092 -1.089739 -0.264981
C  -3.855528 1.31016 -0.160709
C  3.039471 -0.838829 -0.079105
C  -2.045603 -0.861533 -0.212711
C  -2.468502 1.552359 -0.107801
C  -5.856735 -0.279074 -0.26408
C  2.486191 1.561121 0.028256
C  4.418879 -0.486385 -0.024797
C  3.84393 1.891697 0.079838
C  4.818964 0.854415 0.053146
C  1.528655 -2.856417 -0.234774
H  -3.808382 -2.11803 -0.32988
H  -4.554504 2.154717 -0.143886
H  -1.333351 -1.691556 -0.23594
H  -2.068015 2.570018 -0.050638
H  1.707312 2.329414 0.046783
H  -6.418469 0.596499 -0.63312
H  -6.103816 -1.142168 -0.907719
H  -6.236558 -0.51057 0.750563
H  5.147363 -1.302276 -0.047281
H  4.15698 2.939234 0.140523
H  5.886136 1.09881 0.09313
H  1.761887 -3.931573 -0.294012
H  0.977363 -2.519281 -1.128479
H  0.923824 -2.630352 0.659422
