program: Orca
programVersion: 5.0.2
elementType: O O C C C C C C C C C C C C C C C C C C C C C H H H H H H H H H H H H H H H H H H H H H H H H H H H H H H Ag
elementType: Ag
charge: 1
multiplicity: 1
keywords: wB97X-D3 Opt Freq def2-TZVPP def2/J RIJCOSX TightSCF defgrid3 CHELPG
frequency: 0.00 0.00 0.00 0.00 0.00 0.00 28.51 37.70 45.22 61.50 77.08 83.96 89.50 109.23 118.64 137.69 167.33 182.21 205.28 218.77 224.23 230.81 237.17 261.15 265.55 268.53 278.32 294.19 310.90 315.20 327.02 356.32 374.82 390.14 399.74 420.59 426.27 426.98 474.14 485.74 498.27 501.33 528.50 562.14 576.53 610.15 640.81 650.14 688.23 692.71 727.67 766.29 773.36 789.10 796.78 800.38 835.02 861.85 872.35 889.16 905.68 920.94 928.46 933.75 940.39 951.45 955.67 957.63 984.15 1012.41 1016.47 1027.21 1029.71 1035.79 1051.62 1054.01 1088.52 1106.06 1108.98 1120.26 1138.36 1141.68 1174.30 1180.63 1186.29 1197.27 1200.40 1215.24 1226.63 1248.22 1250.92 1257.33 1278.56 1301.41 1304.92 1307.43 1316.15 1329.94 1332.99 1337.85 1343.06 1354.99 1361.74 1365.62 1369.86 1381.39 1384.83 1402.17 1410.71 1419.53 1421.58 1430.09 1437.96 1450.34 1470.71 1482.10 1482.23 1486.05 1495.89 1499.43 1502.81 1503.96 1504.36 1506.56 1510.30 1518.88 1520.97 1523.55 1541.36 1631.67 1661.44 1691.55 2879.95 2939.45 3001.47 3050.41 3054.54 3068.01 3069.45 3071.45 3072.67 3077.51 3082.29 3085.07 3096.68 3100.01 3116.56 3117.91 3120.87 3127.24 3129.22 3143.07 3147.23 3151.39 3151.65 3160.25 3164.56 3183.43 3200.85 3223.68 3227.59 3892.70
frequency: 28.51 37.70 45.22 61.50 77.08 83.96 89.50 109.23 118.64 137.69 167.33 182.21 205.28 218.77 224.23 230.81 237.17 261.15 265.55 268.53 278.32 294.19 310.90 315.20 327.02 356.32 374.82 390.14 399.74 420.59 426.27 426.98 474.14 485.74 498.27 501.33 528.50 562.14 576.53 610.15 640.81 650.14 688.23 692.71 727.67 766.29 773.36 789.10 796.78 800.38 835.02 861.85 872.35 889.16 905.68 920.94 928.46 933.75 940.39 951.45 955.67 957.63 984.15 1012.41 1016.47 1027.21 1029.71 1035.79 1051.62 1054.01 1088.52 1106.06 1108.98 1120.26 1138.36 1141.68 1174.30 1180.63 1186.29 1197.27 1200.40 1215.24 1226.63 1248.22 1250.92 1257.33 1278.56 1301.41 1304.92 1307.43 1316.15 1329.94 1332.99 1337.85 1343.06 1354.99 1361.74 1365.62 1369.86 1381.39 1384.83 1402.17 1410.71 1419.53 1421.58 1430.09 1437.96 1450.34 1470.71 1482.10 1482.23 1486.05 1495.89 1499.43 1502.81 1503.96 1504.36 1506.56 1510.30 1518.88 1520.97 1523.55 1541.36 1631.67 1661.44 1691.55 2879.95 2939.45 3001.47 3050.41 3054.54 3068.01 3069.45 3071.45 3072.67 3077.51 3082.29 3085.07 3096.68 3100.01 3116.56 3117.91 3120.87 3127.24 3129.22 3143.07 3147.23 3151.39 3151.65 3160.25 3164.56 3183.43 3200.85 3223.68 3227.59 3892.70
formula: C21H30O2Ag
InChI: InChI=1S/C21H30O2.Ag/c1-5-6-7-8-15-12-18(22)20-16-11-14(2)9-10-17(16)21(3,4)23-19(20)13-15;/h12-13,16-17,22H,2,5-11H2,1,3-4H3;
54 atoms
O  -1.044497 1.858858 -1.284553
O  0.008964 0.286391 3.100203
C  -2.549924 0.240312 -0.439265
C  -2.014755 0.370714 0.997629
C  -2.468498 1.576857 -1.169581
C  -3.822338 -0.59333 -0.46728
C  -2.255405 -0.960606 1.764496
C  -0.569654 0.818674 0.864588
C  -3.389071 -2.047935 -0.184081
C  -2.24055 -2.096815 0.792324
C  -0.192785 1.535346 -0.299957
C  -3.140844 2.74309 -0.460751
C  -2.944324 1.472252 -2.607106
C  0.405292 0.755225 1.892326
C  1.122205 1.96326 -0.494224
C  2.085218 1.750786 0.472049
C  -1.295358 -3.064004 0.800271
C  1.708962 1.170921 1.683565
C  3.536636 2.041381 0.208242
C  4.282633 0.743284 -0.141118
C  3.886417 0.141186 -1.495071
C  3.944112 -1.384399 -1.527888
C  2.741908 -2.0421 -0.846794
H  -1.821275 -0.367807 -1.00058
H  -2.58262 1.141016 1.522713
H  -4.31926 -0.545588 -1.43423
H  -4.540885 -0.242602 0.276024
H  -3.249803 -0.913135 2.212714
H  -1.545659 -1.098117 2.571575
H  -3.121828 -2.556902 -1.111566
H  -4.211766 -2.616681 0.25837
H  -3.092719 3.634185 -1.084721
H  -2.661665 2.977683 0.488675
H  -4.191007 2.515766 -0.2712
H  -4.031111 1.413971 -2.651265
H  -2.523642 0.59472 -3.099784
H  -2.630769 2.356812 -3.159228
H  1.356982 2.472086 -1.419409
H  -0.631865 -3.169936 1.655042
H  -1.33823 -3.893264 0.103463
H  2.436318 1.058868 2.480649
H  3.634622 2.760948 -0.606245
H  3.990248 2.492772 1.092093
H  4.100111 0.021353 0.661129
H  5.356956 0.932996 -0.129419
H  2.872553 0.452252 -1.76594
H  4.536108 0.54802 -2.271349
H  4.857868 -1.734942 -1.042187
H  3.990071 -1.734816 -2.559838
H  2.62711 -1.65639 0.177364
H  1.846015 -1.835072 -1.468168
H  2.838806 -3.124506 -0.783192
H  0.725456 0.367183 3.73214
Ag 0.250566 -1.419501 -0.0491
totalener: -1115.66745935 hartree
nucrepener: 2590.16724128 hartree
electener: -3705.83470063 hartree
oneelecener: -6704.38018748 hartree
twoeener: 2998.54548685 hartree
kineticenergy: 1020.55323399 hartree
xcener: -106.993943641899 hartree
chargesum: 1.0000000
charge: -0.275978 -0.290039 -0.126399 0.110587 0.326023 -0.202273 -0.169782 -0.361801 -0.145983 0.060716 0.331613 -0.326527 -0.276651 0.364633 -0.368067 0.126365 -0.318653 -0.288281 -0.115217 -0.177158 -0.142734 -0.112964 -0.177395 0.109593 0.118522 0.104553 0.105449 0.126426 0.136694 0.104924 0.120158 0.117181 0.098247 0.107262 0.093822 0.101144 0.115756 0.128925 0.183491 0.138260 0.095254 0.096426 0.103695 0.076321 0.107362 0.063148 0.111716 0.091526 0.092644 0.060032 0.039551 0.127760 0.192853 0.287271
charge: 0.332870 0.379806 -0.063467 -0.031388 -0.227165 0.015898 0.027924 -0.083629 0.016374 -0.038739 -0.186617 0.035485 0.029411 -0.183425 -0.006423 -0.065129 0.015566 -0.029692 0.003317 -0.014601 -0.021350 -0.020845 0.037207 0.048183 0.043021 0.029295 0.028851 0.045096 0.025824 0.037163 0.044920 0.029228 0.018400 0.026740 0.024076 0.020545 0.028369 0.033076 0.029204 0.023466 0.025319 0.035148 0.033551 0.018439 0.026294 0.021437 0.026201 0.029023 0.025860 0.025842 0.029099 0.026607 -0.099195 0.319526
qa: -0.2760 -0.2900 -0.1264 0.1106 0.3260 -0.2023 -0.1698 -0.3618 -0.1460 0.0607 0.3316 -0.3265 -0.2767 0.3646 -0.3681 0.1264 -0.3187 -0.2883 -0.1152 -0.1772 -0.1427 -0.1130 -0.1774 0.1096 0.1185 0.1046 0.1054 0.1264 0.1367 0.1049 0.1202 0.1172 0.0982 0.1073 0.0938 0.1011 0.1158 0.1289 0.1835 0.1383 0.0953 0.0964 0.1037 0.0763 0.1074 0.0631 0.1117 0.0915 0.0926 0.0600 0.0396 0.1278 0.1929 0.2873
va: 2.1694 2.1852 3.7041 3.7014 3.6810 3.8979 3.8908 3.7640 3.9438 3.4213 3.8843 3.9670 3.9330 3.8156 4.0613 3.6113 3.9434 3.9421 3.8845 3.8611 3.8459 3.8965 3.9398 1.0141 1.0028 1.0163 1.0099 1.0133 1.0444 1.0099 1.0084 1.0097 0.9994 1.0032 1.0037 1.0014 1.0139 1.0251 1.0124 1.0335 1.0295 1.0095 1.0097 1.0027 1.0139 1.0169 1.0060 1.0069 1.0107 1.0047 1.0098 1.0155 1.0449 1.3568
dispcorr: -0.034613369 hartree
energy: -1115.711877281871
dipole: -20.36435 20.21720 -0.14715 88.76246 -89.75219 -0.98973 -4.18952 4.54898 0.35946
magnitude: 1.06321 au
magnitude: 2.70248 debye
temp: 298.15 k
press: 1.00 atm
zeropoint: 0.47481980 hartree
thermalvibcorrection: 0.02138135 hartree
thermalrotcorrection: 0.00141627 hartree
thermaltrasncorrection: 0.00141627 hartree
thermaltotal: -1115.21284360 hartree
thermalcorr: 0.02421389 hartree
nonthermalcorr: 0.47481980 hartree
totalcorr: 0.49903369 hartree
thermalcorrenthalpy: 0.00094421 hartree
totalenthalpy: -1115.21189939 hartree
totalentropycorr: -0.07462258 hartree
gibbsenthalpy: -1115.28652197 hartree
gibbsminuselec: 0.42535531 hartree
