program: Orca
programVersion: 5.0.2
elementType: O O C C C C C C C C C C C C C C C C C C C C C H H H H H H H H H H H H H H H H H H H H H H H H H H H H H H Ag
elementType: Ag
charge: 1
multiplicity: 1
keywords: wB97X-D3 Opt Freq def2-TZVPP def2/J RIJCOSX TightSCF defgrid3 CHELPG
frequency: 0.00 0.00 0.00 0.00 0.00 0.00 27.55 33.16 42.78 65.26 73.98 85.81 88.00 103.04 123.92 142.05 160.63 181.92 189.66 212.45 223.91 231.28 240.53 254.35 265.00 274.91 278.84 300.65 306.41 315.22 333.52 354.58 360.16 375.58 388.05 402.51 416.72 428.46 476.76 483.19 497.52 504.00 532.96 561.69 575.39 606.04 636.77 651.58 678.06 705.80 730.28 765.40 772.11 789.15 797.27 801.74 833.33 863.14 888.44 899.44 903.72 922.74 928.99 935.79 941.01 951.15 954.59 957.82 987.81 1010.01 1017.01 1025.33 1029.82 1032.29 1051.36 1054.35 1083.91 1105.48 1110.32 1118.63 1136.36 1141.95 1171.89 1179.81 1182.04 1189.86 1203.94 1212.24 1223.45 1241.83 1251.37 1256.24 1283.54 1294.67 1303.85 1307.93 1318.94 1325.67 1331.04 1338.78 1347.37 1349.94 1363.45 1366.12 1369.96 1380.00 1383.28 1400.40 1408.35 1418.45 1421.63 1431.73 1439.55 1452.56 1472.14 1482.36 1487.67 1492.45 1495.82 1498.83 1503.73 1504.13 1504.44 1505.71 1509.60 1516.54 1521.79 1523.03 1531.09 1624.23 1671.79 1691.76 2878.82 2948.44 3002.40 3029.74 3052.37 3062.48 3069.39 3069.91 3072.98 3073.01 3077.73 3081.55 3086.74 3097.77 3115.46 3118.62 3121.72 3127.30 3128.67 3141.81 3148.74 3150.73 3152.07 3159.95 3160.50 3165.10 3215.73 3222.89 3228.28 3908.64
frequency: 27.55 33.16 42.78 65.26 73.98 85.81 88.00 103.04 123.92 142.05 160.63 181.92 189.66 212.45 223.91 231.28 240.53 254.35 265.00 274.91 278.84 300.65 306.41 315.22 333.52 354.58 360.16 375.58 388.05 402.51 416.72 428.46 476.76 483.19 497.52 504.00 532.96 561.69 575.39 606.04 636.77 651.58 678.06 705.80 730.28 765.40 772.11 789.15 797.27 801.74 833.33 863.14 888.44 899.44 903.72 922.74 928.99 935.79 941.01 951.15 954.59 957.82 987.81 1010.01 1017.01 1025.33 1029.82 1032.29 1051.36 1054.35 1083.91 1105.48 1110.32 1118.63 1136.36 1141.95 1171.89 1179.81 1182.04 1189.86 1203.94 1212.24 1223.45 1241.83 1251.37 1256.24 1283.54 1294.67 1303.85 1307.93 1318.94 1325.67 1331.04 1338.78 1347.37 1349.94 1363.45 1366.12 1369.96 1380.00 1383.28 1400.40 1408.35 1418.45 1421.63 1431.73 1439.55 1452.56 1472.14 1482.36 1487.67 1492.45 1495.82 1498.83 1503.73 1504.13 1504.44 1505.71 1509.60 1516.54 1521.79 1523.03 1531.09 1624.23 1671.79 1691.76 2878.82 2948.44 3002.40 3029.74 3052.37 3062.48 3069.39 3069.91 3072.98 3073.01 3077.73 3081.55 3086.74 3097.77 3115.46 3118.62 3121.72 3127.30 3128.67 3141.81 3148.74 3150.73 3152.07 3159.95 3160.50 3165.10 3215.73 3222.89 3228.28 3908.64
formula: C21H30O2Ag
InChI: InChI=1S/C21H30O2.Ag/c1-5-6-7-8-15-12-18(22)20-16-11-14(2)9-10-17(16)21(3,4)23-19(20)13-15;/h12-13,16-17,22H,2,5-11H2,1,3-4H3;
54 atoms
O  -1.197161 -1.556562 1.591242
O  -0.108689 -0.87912 -3.060242
C  -2.572653 0.052925 0.543354
C  -2.095758 -0.309139 -0.872907
C  -2.596169 -1.182703 1.439139
C  -3.748505 1.016094 0.479414
C  -2.152633 0.962052 -1.776414
C  -0.717585 -0.923769 -0.712637
C  -3.162812 2.3736 0.031282
C  -2.010328 2.182661 -0.922414
C  -0.348329 -1.4521 0.555514
C  -3.366497 -2.371664 0.884512
C  -3.049681 -0.855499 2.849824
C  0.20518 -1.13291 -1.764839
C  0.948195 -1.905072 0.787701
C  1.884784 -1.937097 -0.23551
C  -0.952744 3.01558 -1.010583
C  1.492014 -1.588675 -1.522214
C  3.315411 -2.280185 0.079218
C  3.98938 -1.120577 0.827485
C  4.182172 0.140935 -0.020177
C  4.191749 1.427382 0.803874
C  2.78652 1.901927 1.173164
H  -1.769979 0.646331 1.009794
H  -2.792141 -1.039365 -1.294459
H  -4.234279 1.132368 1.446018
H  -4.511027 0.663542 -0.218074
H  -3.130444 0.99749 -2.261391
H  -1.399981 0.951761 -2.560136
H  -2.843719 2.956981 0.896236
H  -3.919308 2.969805 -0.486336
H  -4.397676 -2.087343 0.669185
H  -3.381792 -3.177466 1.616603
H  -2.918149 -2.76357 -0.027659
H  -2.807419 -1.685787 3.511235
H  -4.127221 -0.699694 2.883277
H  -2.551928 0.038467 3.22765
H  1.191794 -2.255574 1.78245
H  -0.268489 2.945609 -1.85279
H  -0.889983 3.907103 -0.397368
H  2.167768 -1.68477 -2.361582
H  3.350453 -3.177603 0.698815
H  3.860374 -2.502861 -0.839696
H  4.958168 -1.450341 1.206321
H  3.386507 -0.891179 1.711602
H  5.112285 0.054769 -0.584127
H  3.389902 0.217187 -0.774692
H  4.694405 2.224351 0.254601
H  4.766379 1.275911 1.720556
H  2.301415 2.295672 0.255797
H  2.208927 1.086223 1.633603
H  2.785248 2.729272 1.881071
H  -1.047162 -0.988711 -3.21501
Ag 0.434363 1.256558 0.004899
totalener: -1115.66348564 hartree
nucrepener: 2600.00380152 hartree
electener: -3715.66728717 hartree
oneelecener: -6723.54762647 hartree
twoeener: 3007.88033931 hartree
kineticenergy: 1020.54512915 hartree
xcener: -106.991700419720 hartree
chargesum: 1.0000000
charge: -0.277718 -0.279176 -0.126686 0.019844 0.335146 -0.204482 -0.162790 -0.354349 -0.135149 0.028906 0.298286 -0.327607 -0.278930 0.337693 -0.350211 0.109034 -0.316918 -0.243769 -0.109312 -0.182389 -0.127170 -0.123192 -0.147027 0.108158 0.137847 0.106049 0.104844 0.133715 0.130253 0.105298 0.119802 0.108754 0.118524 0.096068 0.116903 0.094105 0.102188 0.127667 0.180517 0.137758 0.131593 0.108750 0.092575 0.108342 0.081213 0.112320 0.048682 0.092019 0.091933 0.029505 0.054596 0.123363 0.201119 0.313505
charge: 0.330212 0.381018 -0.062510 -0.044268 -0.226868 0.016977 0.020103 -0.092512 0.016946 -0.043814 -0.193626 0.035512 0.030200 -0.184059 -0.002480 -0.065614 0.023024 -0.008966 0.004229 -0.015772 -0.021239 -0.021461 0.039148 0.048754 0.038308 0.029795 0.028753 0.044056 0.029959 0.037629 0.044328 0.026764 0.030098 0.018172 0.028994 0.024411 0.021086 0.035818 0.029138 0.023541 0.034294 0.035535 0.034194 0.027053 0.020347 0.026875 0.021467 0.025478 0.030028 0.025769 0.026736 0.028046 -0.109619 0.320014
qa: -0.2777 -0.2792 -0.1267 0.0198 0.3351 -0.2045 -0.1628 -0.3543 -0.1351 0.0289 0.2983 -0.3276 -0.2789 0.3377 -0.3502 0.1090 -0.3169 -0.2438 -0.1093 -0.1824 -0.1272 -0.1232 -0.1470 0.1082 0.1378 0.1060 0.1048 0.1337 0.1303 0.1053 0.1198 0.1088 0.1185 0.0961 0.1169 0.0941 0.1022 0.1277 0.1805 0.1378 0.1316 0.1087 0.0926 0.1083 0.0812 0.1123 0.0487 0.0920 0.0919 0.0295 0.0546 0.1234 0.2011 0.3135
va: 2.1700 2.1938 3.6897 3.7540 3.6650 3.9071 3.8723 3.5849 3.9360 3.4436 3.8924 3.9698 3.9343 3.8889 3.9966 3.5711 3.9451 3.9402 3.8826 3.8721 3.8157 3.9235 3.9619 1.0163 0.9914 1.0161 1.0098 1.0145 1.0370 1.0098 1.0076 1.0031 1.0102 0.9974 1.0139 1.0037 1.0009 1.0270 1.0102 1.0319 1.0237 1.0092 1.0107 1.0136 1.0030 1.0064 1.0183 1.0111 1.0073 1.0031 1.0069 1.0119 1.0353 1.3119
dispcorr: -0.034786178 hartree
energy: -1115.705839565799
dipole: -33.28673 32.41737 -0.86936 -75.75637 76.80203 1.04566 9.13853 -9.11700 0.02153
magnitude: 1.36002 au
magnitude: 3.45689 debye
temp: 298.15 k
press: 1.00 atm
zeropoint: 0.47451483 hartree
thermalvibcorrection: 0.02148546 hartree
thermalrotcorrection: 0.00141627 hartree
thermaltrasncorrection: 0.00141627 hartree
thermaltotal: -1115.20700673 hartree
thermalcorr: 0.02431801 hartree
nonthermalcorr: 0.47451483 hartree
totalcorr: 0.49883284 hartree
thermalcorrenthalpy: 0.00094421 hartree
totalenthalpy: -1115.20606252 hartree
totalentropycorr: -0.07488319 hartree
gibbsenthalpy: -1115.28094571 hartree
gibbsminuselec: 0.42489385 hartree
