program: Gaussian 09
title: 000034697
version: EM64L-G09RevD.01
frameworkgroup: C1[X(C22H31O4P)]
method: RPBEPBE
basis: SDD
operation: Freq
keyword: #p
keyword: freq=noraman
keyword: PBEPBE/SDD
title: #p freq=noraman PBEPBE/SDD
converged: NO YES NO NO
title: Mulliken charges:
elementType: P O O O O C C C C C C C C C C C C C C C C C C C C C C H H H H H H H H H H H H H H H H H H H H H H H H H H H H H H H
charge: 1.335597 -0.478833 -0.538166 -0.536955 -0.588931 -0.392771 -0.398695 -0.367807 -0.387937 -0.020963 -0.356669 -0.385995 -0.715938 -0.720061 -0.279091 0.376301 0.370774 -0.336790 -0.334819 -0.385124 -0.375494 -0.208718 -0.203617 -0.193056 -0.193105 -0.245368 -0.247557 0.195390 0.215801 0.195416 0.195818 0.189003 0.182638 0.185709 0.196048 0.193233 0.201079 0.223143 0.199632 0.221318 0.211711 0.210132 0.206360 0.222057 0.208311 0.204574 0.227175 0.233532 0.293894 0.293418 0.257193 0.256749 0.232169 0.231889 0.232028 0.231740 0.231005 0.231624
chargesum: 0.00000
title: Mulliken charges with hydrogens summed into heavy atoms:
elementType: P O O O O C C C C C C C C C C C C C C C C C C C C C C
charge: 1.335597 -0.478833 -0.538166 -0.536955 -0.588931 0.018420 -0.007461 0.003835 -0.006179 0.172270 0.067553 0.034955 -0.087736 -0.085119 0.181616 0.376301 0.370774 -0.042896 -0.041401 -0.127931 -0.118745 0.023450 0.028272 0.038972 0.038635 -0.014363 -0.015933
polarizability: 3.72055020e+02 -4.00749862e+01 2.12057448e+02 5.90862556e+00 2.25740774e+01 2.34880198e+02
1716.lowfreq: -8.1599 0.0008 0.0015 0.0019 2.7226 4.4806 6.6038 13.0311 16.6559
frequency: 3.9872 12.8109 16.4885 21.4705 25.0069 28.5135 40.1473 42.7872 49.4289 61.0575 79.8309 82.7741 111.8798 123.1555 123.8229 142.4381 153.8757 167.9931 185.2796 204.0729 213.9447 216.2563 234.6654 238.1264 242.9803 256.5008 273.6107 289.5276 296.9734 358.9994 369.2300 381.2336 409.1754 409.9283 419.2369 431.1623 443.5261 478.8984 479.8900 492.4394 509.3942 514.2037 552.8315 603.7630 607.9360 626.4836 683.0010 690.9483 692.1398 695.1543 726.9166 744.7328 760.7792 762.3335 783.9791 810.6064 830.0587 835.5543 836.7589 837.2405 845.7812 879.4748 883.2860 914.1803 915.0258 916.4331 931.8264 937.2639 949.1509 965.0209 970.5197 971.5280 985.4024 985.6712 990.5415 990.8659 1019.0562 1021.6713 1022.5060 1027.6166 1052.8991 1056.9441 1074.7731 1079.5391 1081.8839 1089.5790 1100.5456 1133.8454 1140.9295 1155.0272 1165.5544 1170.1458 1172.9070 1176.3650 1178.0754 1187.3694 1193.8143 1198.8258 1224.5700 1241.9404 1266.6421 1268.6920 1289.4454 1292.6177 1297.7852 1311.6772 1314.1584 1316.0605 1332.0874 1339.4585 1344.2060 1356.6567 1360.9409 1366.9231 1377.1368 1380.9293 1381.7068 1392.8141 1441.1095 1442.3244 1444.4717 1455.1700 1460.3068 1463.9802 1470.0702 1470.3135 1471.0599 1472.9347 1475.3250 1477.5964 1479.6830 1481.6942 1490.8129 1592.5663 1595.6193 1603.0296 1604.3204 2944.4680 2950.4970 2952.0079 2957.1531 2964.1892 2965.1438 2968.7961 2969.3553 2975.7258 2992.8051 2998.4869 3001.4124 3007.9918 3026.2567 3037.6254 3052.0698 3055.9089 3062.4422 3065.0633 3072.4338 3072.6351 3130.9868 3133.2556 3140.9309 3142.9202 3153.8883 3156.0715 3164.2745 3165.9820 3173.7972 3175.9837
redmass: 4.2653 5.4871 3.8612 4.0059 4.8144 3.2795 4.1246 3.9164 4.4535 5.1037 2.8520 2.4923 2.5517 2.8047 2.7511 6.3341 3.0795 5.6730 3.5426 1.0753 3.1877 4.1718 7.4084 2.0339 1.3627 2.6286 5.2639 3.9641 3.8310 3.0329 5.0206 4.2823 2.9520 2.9463 2.0306 2.7533 11.1682 3.9799 3.6484 3.2429 2.5321 4.6285 7.6000 6.6156 6.6373 6.2918 8.0452 2.5078 2.3978 3.4838 1.2051 1.2626 1.4957 1.5059 1.5017 2.5537 8.5635 1.8792 1.2488 1.2631 3.7653 2.8491 2.0266 1.2475 1.3528 1.3660 2.2783 1.7647 1.4112 1.7112 1.3651 1.3627 6.2638 6.3045 1.3047 1.3064 2.4479 2.1679 2.1272 1.4321 3.0440 7.7019 1.9755 1.5395 1.6400 2.0799 2.1935 1.9876 2.0604 2.6765 1.2609 1.1516 1.5557 1.5040 1.7300 1.1865 1.6186 1.4844 1.3474 1.2928 1.2793 1.2335 1.1911 1.0976 1.1295 1.2390 1.3189 1.3181 1.4252 1.4952 1.4642 1.5075 1.3131 1.5216 1.2219 8.8246 8.9476 1.2153 2.2615 2.2680 1.0814 1.0706 1.0766 1.0821 1.1573 1.7216 1.0605 1.7066 1.2892 1.1030 1.0644 1.0901 1.0496 6.1795 6.2544 6.5733 6.5065 1.0646 1.0587 1.0756 1.0620 1.0435 1.0519 1.0380 1.0595 1.0636 1.0971 1.0587 1.0956 1.1016 1.0972 1.1043 1.1032 1.0994 1.0993 1.0990 1.1026 1.1046 1.0852 1.0852 1.0894 1.0894 1.0938 1.0938 1.0971 1.0971 1.1001 1.1002
irintensity: 0.0336 0.3649 0.2015 0.0416 0.3886 0.3501 0.2320 0.1536 0.3140 1.3969 0.1040 0.1815 0.2771 1.4499 0.4307 6.0510 0.6195 0.0908 1.1956 0.0729 0.8962 1.7227 12.3181 0.1380 0.8059 3.5104 4.7675 11.1652 10.3550 1.1287 19.3574 9.1987 0.6852 0.7520 0.9947 2.0884 103.9080 3.2614 4.9906 28.7548 1.4291 9.6016 6.9431 1.0781 20.6011 10.1069 126.4998 5.6374 10.2230 104.7402 10.1646 16.4693 17.0521 197.2783 14.7030 4.6308 641.7722 8.7572 0.2442 1.0170 37.1030 110.1721 44.0346 2.2089 5.8516 25.7714 13.7521 13.3070 5.5804 18.9573 0.1484 0.0378 1.8150 1.0368 1.2697 2.7193 29.2198 56.0119 0.0522 9.9687 9.1554 103.6610 3.7504 7.4166 6.1220 2.7359 0.4854 3.4508 0.4205 469.4166 1.4628 58.8126 3.2501 4.6887 5.2682 49.0927 5.7898 2.9982 2.6513 3.5178 3.0241 4.3045 0.2784 1.8891 1.7819 0.7631 1.8524 0.1470 2.9226 1.6550 1.7577 0.7093 4.0932 5.5736 22.0568 4.2028 0.7307 17.1127 12.3773 11.3125 5.1882 0.1086 3.7120 1.0251 59.0957 200.1132 9.1547 4.9872 5.4212 15.7838 10.5802 12.2850 20.8848 98.8588 15.7427 54.6492 11.7879 8.3523 21.9286 29.0867 17.5866 11.5754 105.9598 30.3837 11.9566 49.0869 11.5409 28.7858 41.7863 1.0757 0.6046 112.3562 64.1093 3.6975 81.4409 72.9629 96.2299 5.7434 0.3568 0.2893 14.4348 15.2520 10.5554 9.7515 16.1242 19.1585 10.6746 11.1631
temp: 298.150 k
press: 1.00000 atm
elementType: 15 8 8 8 8 6 6 6 6 6 6 6 6 6 6 6 6 6 6 6 6 6 6 6 6 6 6 1 1 1 1 1 1 1 1 1 1 1 1 1 1 1 1 1 1 1 1 1 1 1 1 1 1 1 1 1 1 1
symmnumber: 1
zpe: 1266421.7 jmol-1
zpe.correction: 0.482355 hartree
zpe.thermalcorrener: 0.512138 hartree
zpe.thermalcorrenthalpy: 0.513082 hartree
zpe.thermalcorrgfe: 0.414212 hartree
zpe.sumelectzpe: -1496.988925 hartree
zpe.sumelectthermal: -1496.959142 hartree
zpe.sumelectthermalent: -1496.958197 hartree
zpe.sumelectthermalfe: -1497.057068 hartree
dipole: 1.1652 2.6890 1.8843
dipole: 3.4841
quadrupole: -154.3445 -171.4903 -168.9854
quadrupole: -12.5311 -3.2789 5.3919
quadrupole: 10.5956 -6.5502 -4.0453 -12.5311 -3.2789 5.3919
hfenergy: -1497.4712794 hartree
pointgroup: C01 [X(C22H31O4P1)]
dipole: -0.4274682 0.864213 -0.9743737 debye
polarizability: 373.3535983|37.9955809|201.8982514|-1.4111555|-14.2531992|243.7408158 unknown
InChI: InChI=1S/C22H31O4P/c1-20(2)14-8-4-3-5-13-19-24-27(23,25-21-15-9-6-10-16-21)26-22-17-11-7-12-18-22/h6-7,9-12,15-18,20H,3-5,8,13-14,19H2,1-2H3
charge 0 multiplicity 1
58 atoms
P  2.059644 -0.431425 0.652016
O  1.530876 1.196481 0.540139
O  0.94727 -1.35999 -0.301594
O  3.331046 -0.620308 -0.509509
O  2.319191 -0.859932 2.153112
C  -4.305661 1.641638 -0.270122
C  -3.639983 2.752929 0.576093
C  -5.67647 1.203156 0.294465
C  -2.320385 3.302159 -0.01918
C  -6.306312 -0.027788 -0.411505
C  -1.201856 2.242301 -0.146919
C  0.145722 2.854539 -0.586749
C  -7.590155 -0.478164 0.325956
C  -6.607567 0.243795 -1.905459
C  1.249809 1.818551 -0.801478
C  -0.355647 -1.727552 0.158061
C  4.677962 -0.199603 -0.271196
C  -0.67223 -1.92318 1.520898
C  5.255156 -0.13637 1.016644
C  -1.305082 -1.941591 -0.863695
C  5.418565 0.098443 -1.43458
C  -1.985405 -2.328475 1.853588
C  6.61002 0.252712 1.125961
C  -2.607744 -2.356244 -0.51106
C  6.773478 0.473775 -1.303852
C  -2.954685 -2.545839 0.847824
C  7.372607 0.556945 -0.024698
H  -4.42251 2.005616 -1.31151
H  -3.640202 0.755998 -0.315394
H  -3.444081 2.362672 1.596744
H  -4.358054 3.590784 0.69479
H  -5.554907 0.967167 1.372783
H  -6.390092 2.053462 0.240383
H  -2.523958 3.744311 -1.017606
H  -1.954753 4.131737 0.621049
H  -5.56681 -0.85655 -0.355508
H  -1.502629 1.462187 -0.875241
H  -1.065793 1.729783 0.825012
H  0.018897 3.404363 -1.543433
H  0.48897 3.594855 0.161732
H  -7.384305 -0.705936 1.388964
H  -8.027086 -1.382107 -0.138794
H  -8.357444 0.319855 0.294984
H  -5.690343 0.476831 -2.475706
H  -7.084392 -0.634893 -2.379281
H  -7.300551 1.101404 -2.012326
H  0.937161 1.030467 -1.512906
H  2.192997 2.278009 -1.14721
H  0.083393 -1.77111 2.298637
H  4.668806 -0.387953 1.906355
H  -1.011425 -1.791807 -1.906873
H  4.932706 0.024898 -2.411971
H  -2.243446 -2.481416 2.907138
H  7.068246 0.309018 2.119327
H  -3.34902 -2.528755 -1.299149
H  7.356988 0.702969 -2.202172
H  -3.967095 -2.864239 1.118122
H  8.422467 0.852417 0.0729
