program: Gaussian 09
title: 000034613
version: EM64L-G09RevD.01
frameworkgroup: C1[X(C19H19NO3)]
method: RPBEPBE
basis: SDD
operation: Freq
keyword: #p
keyword: freq=noraman
keyword: PBEPBE/SDD
title: #p freq=noraman PBEPBE/SDD
converged: YES YES NO NO
title: Mulliken charges:
elementType: O O O N C C C C C C C C C C C C C C C C C C C H H H H H H H H H H H H H H H H H H H
charge: -0.219633 -0.428799 -0.239007 -0.083771 0.039920 0.294188 -0.555213 0.160944 0.144837 0.140110 -0.355333 -0.315121 -0.396903 0.020575 0.306121 -0.627359 -0.623769 -0.371768 -0.369508 0.431309 -0.420070 -0.360760 -0.805462 0.230090 0.286086 0.255489 0.300904 0.220065 0.232177 0.198411 0.215984 0.231533 0.215664 0.189558 0.263428 0.273287 0.354466 0.235184 0.234349 0.233383 0.237243 0.227171
chargesum: 0.00000
title: Mulliken charges with hydrogens summed into heavy atoms:
elementType: O O O N C C C C C C C C C C C C C C C C C C C
charge: -0.219633 -0.074333 -0.239007 -0.083771 0.039920 0.294188 -0.039038 0.160944 0.144837 0.140110 -0.099843 -0.014217 -0.176838 0.020575 0.306121 0.019213 0.012985 -0.108340 -0.096221 0.431309 -0.184886 -0.126411 -0.107665
polarizability: 3.44206080e+02 9.05376047e+00 2.12427133e+02 -2.15658819e+00 2.26358945e+01 1.50935731e+02
1716.lowfreq: -7.2855 -3.4077 -0.0005 0.0004 0.0005 9.8052 15.3935 19.7522 35.8210
frequency: 15.0569 19.6134 35.7209 43.4806 48.4815 57.4718 82.3508 104.9085 127.7614 143.1705 166.8941 217.8092 230.6331 241.4877 251.4076 259.0058 270.5250 282.1953 299.8165 304.0936 344.1727 351.1191 379.6450 393.3114 399.9814 410.8214 428.3112 446.6140 480.3636 491.1268 511.1535 556.8633 588.8071 598.9223 631.7218 641.8784 650.1142 686.4481 711.4992 743.5213 751.6785 768.8577 785.4815 785.8573 812.1459 824.0007 842.9251 856.5947 862.7042 882.0186 912.0744 964.3910 973.3304 986.2500 992.1600 1006.4510 1013.8008 1020.0340 1035.6208 1046.8787 1085.5891 1089.6003 1107.1298 1124.2646 1127.4979 1146.9807 1159.4157 1183.7423 1191.7744 1205.6744 1223.5919 1235.1741 1250.6597 1251.3131 1257.8628 1290.5872 1308.2812 1342.8634 1365.7760 1368.5296 1394.2530 1397.0206 1408.8433 1415.9170 1427.0339 1439.8867 1459.8808 1467.8050 1469.7498 1472.3753 1475.4097 1480.6970 1487.2304 1492.5924 1499.4037 1513.8902 1537.3652 1576.6834 1589.7306 1618.2412 1628.3004 2844.6829 2859.1390 2953.5189 2978.2496 3012.6628 3017.1117 3053.5462 3057.6546 3072.1060 3075.9614 3088.7311 3123.3349 3124.9906 3127.1495 3153.3489 3159.6602 3181.7354 3254.1282 3585.3726
redmass: 1.0238 4.8190 3.3808 3.3639 4.1935 4.1145 4.9699 5.1611 4.5940 6.1868 6.5828 3.4916 1.4414 4.0475 3.6701 2.3404 1.4233 2.2618 4.2096 1.2247 3.2815 5.3168 3.9570 2.5422 3.6831 2.8962 2.6218 8.2700 3.2970 4.0104 4.1333 4.9152 4.2438 5.4829 6.6754 6.0427 4.5134 5.3293 4.0977 6.3542 3.0851 5.0396 1.6038 4.7917 4.7854 1.6026 1.6286 4.7314 1.3405 3.2805 1.3208 4.3417 1.3272 1.4228 1.3966 2.3550 2.7225 2.2662 1.5659 1.5808 2.5981 1.2785 4.9688 1.3225 1.3810 1.3493 1.8630 2.0201 1.2753 2.1152 2.9298 2.2477 2.5819 3.7483 1.9304 1.4961 1.2896 4.5965 1.4621 4.4993 3.5276 1.2413 3.6454 1.1669 4.4486 1.1803 1.0483 1.0666 1.0656 1.1036 1.0609 1.2063 1.3748 1.9185 2.6863 4.7737 6.9662 6.4591 7.9904 6.2888 8.1727 1.0569 1.0567 1.0666 1.0378 1.0719 1.0727 1.0937 1.0965 1.1002 1.1001 1.0992 1.0901 1.0889 1.0885 1.0948 1.0958 1.0958 1.0991 1.0661
irintensity: 0.4869 0.8256 0.1804 2.0203 0.4701 2.3346 2.6285 0.8241 1.8849 0.8169 0.2244 1.9443 2.2082 2.1436 1.9260 11.7175 7.5438 2.4492 5.2540 106.2820 2.7597 10.8739 9.4752 2.3515 2.6781 0.4320 1.2315 0.6206 9.8471 8.7483 2.3340 5.8389 6.0765 6.7046 2.4651 4.9034 8.5069 3.0233 15.9670 16.8241 57.0453 21.1426 46.0904 16.3478 16.3363 14.3664 29.7362 75.1126 13.0109 13.7099 1.6583 1.4343 0.9284 1.4851 14.7286 68.8304 19.4723 34.9800 17.5023 14.9586 102.4280 9.8412 81.2710 19.6446 20.6228 60.8164 63.6457 19.4564 24.1188 5.4778 0.9969 52.2715 29.0769 77.7437 117.2051 1.1219 3.6148 68.6057 13.9861 0.6367 70.8222 13.8431 8.9957 1.8445 10.6887 1.5895 17.1877 9.2463 11.2267 9.0177 20.6575 48.5721 8.1548 40.5490 0.7048 111.8412 118.0211 11.6249 39.6087 67.8350 1.9184 103.9123 155.8663 20.2187 30.3911 47.4966 43.3650 4.4553 17.7563 29.7190 51.8319 17.4624 16.7861 13.5182 21.4814 13.5340 3.7099 3.9414 1.7829 41.6497
temp: 298.150 k
press: 1.00000 atm
elementType: 8 8 8 7 6 6 6 6 6 6 6 6 6 6 6 6 6 6 6 6 6 6 6 1 1 1 1 1 1 1 1 1 1 1 1 1 1 1 1 1 1 1
symmnumber: 1
zpe: 873652.2 jmol-1
zpe.correction: 0.332757 hartree
zpe.thermalcorrener: 0.354495 hartree
zpe.thermalcorrenthalpy: 0.355439 hartree
zpe.thermalcorrgfe: 0.279583 hartree
zpe.sumelectzpe: -1014.162420 hartree
zpe.sumelectthermal: -1014.140681 hartree
zpe.sumelectthermalent: -1014.139737 hartree
zpe.sumelectthermalfe: -1014.215593 hartree
dipole: 1.4923 -1.8627 -1.9405
dipole: 3.0761
quadrupole: -94.7607 -134.2305 -138.0845
quadrupole: 5.5768 -0.6178 1.2288
quadrupole: 27.5978 -11.8719 -15.7259 5.5768 -0.6178 1.2288
hfenergy: -1014.4951761 hartree
pointgroup: C01[X(C19H19N1O3)]
dipole: -0.3650051 0.51476 -1.032681 debye
polarizability: 341.1783383|-16.3986534|191.5667025|13.2506644|-38.9221567|174.8239033 unknown
InChI: InChI=1S/C19H19NO3/c1-12-4-6-13(7-5-12)19(22)15-11-23-17-9-8-16(21)14(18(15)17)10-20(2)3/h4-9,11,21H,10H2,1-3H3
charge 0 multiplicity 1
42 atoms
O  1.355962 2.419164 -1.181435
O  4.506267 -1.67281 0.883828
O  -0.906167 -0.331781 1.811148
N  1.57414 -3.035036 0.342306
C  1.5933 0.421756 0.021128
C  2.345936 -0.673301 0.538686
C  1.765425 -1.875049 1.266632
C  0.16554 0.802537 -0.024176
C  2.275128 1.443792 -0.708651
C  3.752208 -0.623256 0.323894
C  3.651286 1.483103 -0.940443
C  0.100811 1.985106 -0.754489
C  4.398653 0.420967 -0.394324
C  -1.018249 0.239147 0.677455
C  -2.376078 0.391221 0.051519
C  0.429128 -2.871197 -0.572876
C  1.531785 -4.3175 1.069376
C  -2.579446 0.488061 -1.350768
C  -3.514007 0.366133 0.904057
C  -5.0219 0.573774 -1.03159
C  -3.885588 0.573372 -1.879813
C  -4.810748 0.46439 0.371566
C  -6.425525 0.68826 -1.596407
H  2.497175 -2.196705 2.027538
H  0.825749 -1.590709 1.784952
H  4.116904 2.291701 -1.508594
H  -0.731093 2.640229 -0.998661
H  5.487486 0.399014 -0.52863
H  0.548455 -1.944081 -1.160646
H  -0.558806 -2.826663 -0.04747
H  0.402895 -3.71899 -1.281896
H  2.459472 -4.439213 1.656286
H  1.473186 -5.150388 0.34446
H  0.660997 -4.410973 1.768407
H  -1.721572 0.456788 -2.030586
H  -3.349518 0.262308 1.981682
H  5.463917 -1.572736 0.659034
H  -4.025708 0.63046 -2.965814
H  -5.676483 0.453585 1.045037
H  -7.092064 -0.088071 -1.17807
H  -6.874459 1.668705 -1.346328
H  -6.431594 0.587986 -2.695026
