program: Orca
programVersion: 5.0.2
elementType: O O C C C C C C C C C C C C C C C C C C C C C H H H H H H H H H H H H H H H H H H H H H H H H H H H H H H Ag
elementType: Ag
charge: 1
multiplicity: 1
keywords: wB97X-D3 Opt Freq def2-TZVPP def2/J RIJCOSX TightSCF defgrid3 CHELPG
frequency: 0.00 0.00 0.00 0.00 0.00 0.00 25.83 34.46 37.13 56.45 74.39 86.22 86.84 104.11 109.00 137.37 146.69 179.16 180.84 200.75 205.50 222.74 228.47 249.05 252.32 267.49 282.79 305.11 309.09 323.70 334.96 337.02 356.38 370.64 385.89 413.92 419.94 454.50 475.49 492.92 501.27 515.14 521.19 546.38 569.99 573.25 607.02 638.33 674.15 681.67 699.74 743.17 763.00 788.09 794.79 808.00 841.11 847.32 860.29 871.32 897.71 903.21 915.08 922.30 940.49 950.70 959.19 989.06 998.90 1012.31 1015.33 1034.03 1041.39 1048.45 1071.06 1084.95 1086.70 1102.33 1106.57 1129.86 1131.91 1147.02 1163.42 1174.75 1190.11 1198.28 1209.85 1216.12 1234.35 1245.13 1254.04 1273.38 1295.15 1301.59 1306.62 1308.13 1326.06 1329.89 1345.25 1348.53 1359.40 1368.22 1369.96 1378.64 1387.65 1393.29 1402.56 1410.26 1413.35 1420.07 1423.08 1430.30 1434.68 1483.35 1484.54 1485.44 1490.45 1492.28 1494.31 1498.48 1499.51 1501.80 1505.70 1506.22 1514.32 1515.31 1516.44 1528.85 1542.15 1632.43 1666.06 1747.08 2858.75 2981.31 2989.32 3001.97 3030.22 3049.98 3055.80 3061.98 3063.44 3074.58 3074.77 3076.48 3081.27 3096.97 3111.40 3117.89 3118.23 3124.39 3124.90 3132.63 3132.94 3138.90 3153.53 3155.99 3158.21 3163.25 3168.68 3177.52 3224.95 3813.22
frequency: 25.83 34.46 37.13 56.45 74.39 86.22 86.84 104.11 109.00 137.37 146.69 179.16 180.84 200.75 205.50 222.74 228.47 249.05 252.32 267.49 282.79 305.11 309.09 323.70 334.96 337.02 356.38 370.64 385.89 413.92 419.94 454.50 475.49 492.92 501.27 515.14 521.19 546.38 569.99 573.25 607.02 638.33 674.15 681.67 699.74 743.17 763.00 788.09 794.79 808.00 841.11 847.32 860.29 871.32 897.71 903.21 915.08 922.30 940.49 950.70 959.19 989.06 998.90 1012.31 1015.33 1034.03 1041.39 1048.45 1071.06 1084.95 1086.70 1102.33 1106.57 1129.86 1131.91 1147.02 1163.42 1174.75 1190.11 1198.28 1209.85 1216.12 1234.35 1245.13 1254.04 1273.38 1295.15 1301.59 1306.62 1308.13 1326.06 1329.89 1345.25 1348.53 1359.40 1368.22 1369.96 1378.64 1387.65 1393.29 1402.56 1410.26 1413.35 1420.07 1423.08 1430.30 1434.68 1483.35 1484.54 1485.44 1490.45 1492.28 1494.31 1498.48 1499.51 1501.80 1505.70 1506.22 1514.32 1515.31 1516.44 1528.85 1542.15 1632.43 1666.06 1747.08 2858.75 2981.31 2989.32 3001.97 3030.22 3049.98 3055.80 3061.98 3063.44 3074.58 3074.77 3076.48 3081.27 3096.97 3111.40 3117.89 3118.23 3124.39 3124.90 3132.63 3132.94 3138.90 3153.53 3155.99 3158.21 3163.25 3168.68 3177.52 3224.95 3813.22
formula: C21H30O2Ag
InChI: InChI=1S/C21H30O2.Ag/c1-5-6-7-8-15-12-18(22)20-16-11-14(2)9-10-17(16)21(3,4)23-19(20)13-15;/h11-13,16-17,22H,5-10H2,1-4H3;
54 atoms
O  -0.603498 1.260282 -1.345274
O  -1.349269 -2.678711 1.26749
C  -2.854214 1.071249 -0.517261
C  -2.487602 -0.150553 0.339941
C  -1.668653 2.019234 -0.695799
C  -4.135117 1.72506 0.017585
C  -1.131748 -0.685735 -0.041512
C  -5.038849 0.744555 0.802275
C  -3.629594 -1.131443 0.180856
C  -4.870022 -0.692174 0.381069
C  -0.284178 0.056523 -0.864642
C  -1.102304 2.57597 0.604923
C  -1.982483 3.132835 -1.676301
C  -0.665635 -1.929684 0.39606
C  0.979391 -0.449815 -1.275091
C  -6.090626 -1.536125 0.20794
C  1.361558 -1.770768 -0.902553
C  0.550321 -2.472142 -0.043555
C  2.624765 -2.387927 -1.454177
C  3.926869 -1.74196 -0.958446
C  4.157706 -1.899674 0.54679
C  5.16494 -0.919003 1.148099
C  4.65052 0.515242 1.249427
H  -3.06247 0.681013 -1.517565
H  -2.446955 0.173719 1.390678
H  -3.893306 2.564265 0.672197
H  -4.694718 2.142393 -0.818861
H  -4.799994 0.814544 1.86829
H  -6.08067 1.050699 0.712488
H  -3.447162 -2.133672 -0.193344
H  -0.797715 1.785386 1.293136
H  -1.838354 3.192077 1.118735
H  -0.238598 3.20651 0.389587
H  -2.369215 2.724906 -2.609684
H  -1.083358 3.707231 -1.897161
H  -2.726023 3.80992 -1.257861
H  1.44333 0.030645 -2.132417
H  -6.671877 -1.564441 1.132308
H  -6.741716 -1.113527 -0.560464
H  -5.841554 -2.55818 -0.073119
H  0.815363 -3.464644 0.295102
H  2.593034 -2.326312 -2.544154
H  2.631928 -3.449187 -1.201413
H  4.765832 -2.186515 -1.496875
H  3.93193 -0.686127 -1.254825
H  -2.214425 -2.300866 1.45625
H  4.487632 -2.921323 0.743048
H  3.207973 -1.801699 1.091781
H  5.43691 -1.257337 2.148553
H  6.08626 -0.922647 0.561337
H  5.342247 1.180477 1.764886
H  3.731842 0.554381 1.876226
H  4.507187 0.975413 0.25899
Ag 2.244091 0.57064 0.293007
totalener: -1115.66257445 hartree
nucrepener: 2473.34997433 hartree
electener: -3589.01254878 hartree
oneelecener: -6471.22653472 hartree
twoeener: 2882.21398595 hartree
kineticenergy: 1020.59598961 hartree
xcener: -106.987590496227 hartree
chargesum: 1.0000000
charge: -0.293673 -0.258826 -0.026008 0.103661 0.326144 -0.293542 -0.118204 -0.107063 -0.338744 -0.021509 0.148580 -0.361879 -0.254934 0.183645 -0.144815 -0.209137 -0.095697 -0.098514 -0.181075 -0.123043 -0.103141 -0.186029 -0.088200 0.109133 0.108776 0.097948 0.107734 0.099107 0.094914 0.138467 0.081604 0.120068 0.108113 0.110281 0.105247 0.097571 0.230289 0.105147 0.099710 0.085020 0.131691 0.120208 0.102759 0.117349 0.052813 0.224164 0.113888 0.050299 0.100522 0.090849 0.129434 0.025283 0.062346 0.321270
charge: 0.332711 0.406709 -0.052373 -0.069108 -0.221694 0.009403 -0.068155 0.005427 -0.033689 -0.071319 -0.189675 0.029746 0.033914 -0.163293 -0.075842 0.024684 -0.061419 -0.001707 0.008848 -0.014076 -0.022958 -0.019713 0.039007 0.048368 0.043580 0.022413 0.026593 0.032434 0.031331 0.017173 0.016211 0.026222 0.024383 0.026040 0.022963 0.026698 0.046881 0.027536 0.026513 0.022825 0.034531 0.039729 0.039683 0.033027 0.020842 -0.107230 0.032943 0.026753 0.030560 0.032321 0.037021 0.034298 0.028832 0.403097
qa: -0.2937 -0.2588 -0.0260 0.1037 0.3261 -0.2935 -0.1182 -0.1071 -0.3387 -0.0215 0.1486 -0.3619 -0.2549 0.1836 -0.1448 -0.2091 -0.0957 -0.0985 -0.1811 -0.1230 -0.1031 -0.1860 -0.0882 0.1091 0.1088 0.0979 0.1077 0.0991 0.0949 0.1385 0.0816 0.1201 0.1081 0.1103 0.1052 0.0976 0.2303 0.1051 0.0997 0.0850 0.1317 0.1202 0.1028 0.1173 0.0528 0.2242 0.1139 0.0503 0.1005 0.0908 0.1294 0.0253 0.0623 0.3213
va: 2.1816 2.2599 3.8071 3.8738 3.7773 3.9517 3.4409 3.9172 3.7996 3.7991 3.9603 3.9487 3.9098 4.0834 3.7788 3.9448 3.7432 3.9426 3.9894 3.7542 3.7207 4.0302 3.9130 1.0156 1.0014 1.0056 1.0064 1.0074 1.0117 1.0179 0.9979 1.0196 1.0071 1.0081 1.0114 1.0033 1.0101 0.9965 0.9975 1.0096 1.0165 1.0075 1.0076 1.0124 1.0194 1.0349 1.0093 1.0245 1.0094 1.0094 1.0029 1.0213 1.0135 1.2647
dispcorr: -0.031254336 hartree
energy: -1115.710227642775
dipole: -152.81950 154.03599 1.21649 -40.62428 41.22897 0.60469 -18.09564 18.62052 0.52488
magnitude: 1.45637 au
magnitude: 3.70180 debye
temp: 298.15 k
press: 1.00 atm
zeropoint: 0.47388450 hartree
thermalvibcorrection: 0.02174646 hartree
thermalrotcorrection: 0.00141627 hartree
thermaltrasncorrection: 0.00141627 hartree
thermaltotal: -1115.21176415 hartree
thermalcorr: 0.02457900 hartree
nonthermalcorr: 0.47388450 hartree
totalcorr: 0.49846349 hartree
thermalcorrenthalpy: 0.00094421 hartree
totalenthalpy: -1115.21081994 hartree
totalentropycorr: -0.07582485 hartree
gibbsenthalpy: -1115.28664479 hartree
gibbsminuselec: 0.42358285 hartree
