program: Orca
programVersion: 5.0.2
elementType: O O C C C C C C C C C C C C C C C C C C C C C H H H H H H H H H H H H H H H H H H H H H H H H H H H H H H Ag
elementType: Ag
charge: 1
multiplicity: 1
keywords: wB97X-D3 Opt Freq def2-TZVPP def2/J RIJCOSX TightSCF defgrid3 CHELPG
frequency: 0.00 0.00 0.00 0.00 0.00 0.00 30.12 38.15 43.09 51.99 72.49 80.37 87.72 94.59 109.58 127.57 132.92 148.30 168.53 184.00 197.08 208.69 219.21 235.87 250.22 259.58 268.48 279.28 289.67 293.64 317.62 336.72 338.52 373.76 382.35 427.54 434.88 439.80 448.25 469.92 485.16 497.04 520.71 540.96 544.73 566.32 607.98 649.47 660.37 680.60 684.55 716.89 746.81 784.26 789.74 820.40 825.99 856.25 867.09 872.96 898.84 916.39 935.43 937.08 938.87 953.22 968.89 990.14 998.08 1011.75 1028.36 1030.64 1052.65 1054.70 1072.43 1083.51 1091.13 1096.43 1109.96 1122.63 1136.56 1151.82 1163.37 1180.32 1189.77 1201.64 1209.64 1216.27 1226.38 1232.45 1237.51 1273.06 1288.23 1298.79 1305.12 1313.51 1319.90 1328.77 1331.11 1338.30 1347.32 1353.41 1364.60 1376.79 1395.98 1400.35 1406.39 1413.34 1415.00 1423.95 1425.82 1431.48 1437.02 1452.98 1465.18 1470.75 1483.54 1485.32 1487.04 1491.51 1494.86 1495.58 1496.69 1498.92 1503.31 1508.25 1509.20 1514.92 1531.26 1621.31 1678.44 1778.55 2769.29 2844.84 2935.06 3000.08 3049.31 3050.54 3055.35 3060.98 3068.91 3073.91 3077.37 3081.35 3083.26 3096.68 3104.17 3107.32 3115.27 3121.89 3131.05 3132.35 3152.29 3156.00 3156.31 3157.11 3161.78 3167.75 3185.21 3189.76 3223.66 3887.64
frequency: 30.12 38.15 43.09 51.99 72.49 80.37 87.72 94.59 109.58 127.57 132.92 148.30 168.53 184.00 197.08 208.69 219.21 235.87 250.22 259.58 268.48 279.28 289.67 293.64 317.62 336.72 338.52 373.76 382.35 427.54 434.88 439.80 448.25 469.92 485.16 497.04 520.71 540.96 544.73 566.32 607.98 649.47 660.37 680.60 684.55 716.89 746.81 784.26 789.74 820.40 825.99 856.25 867.09 872.96 898.84 916.39 935.43 937.08 938.87 953.22 968.89 990.14 998.08 1011.75 1028.36 1030.64 1052.65 1054.70 1072.43 1083.51 1091.13 1096.43 1109.96 1122.63 1136.56 1151.82 1163.37 1180.32 1189.77 1201.64 1209.64 1216.27 1226.38 1232.45 1237.51 1273.06 1288.23 1298.79 1305.12 1313.51 1319.90 1328.77 1331.11 1338.30 1347.32 1353.41 1364.60 1376.79 1395.98 1400.35 1406.39 1413.34 1415.00 1423.95 1425.82 1431.48 1437.02 1452.98 1465.18 1470.75 1483.54 1485.32 1487.04 1491.51 1494.86 1495.58 1496.69 1498.92 1503.31 1508.25 1509.20 1514.92 1531.26 1621.31 1678.44 1778.55 2769.29 2844.84 2935.06 3000.08 3049.31 3050.54 3055.35 3060.98 3068.91 3073.91 3077.37 3081.35 3083.26 3096.68 3104.17 3107.32 3115.27 3121.89 3131.05 3132.35 3152.29 3156.00 3156.31 3157.11 3161.78 3167.75 3185.21 3189.76 3223.66 3887.64
formula: C21H30O2Ag
InChI: InChI=1S/C21H30O2.Ag/c1-5-6-7-8-15-12-18(22)20-16-11-14(2)9-10-17(16)21(3,4)23-19(20)13-15;/h9,12-13,16-17,22H,5-8,10-11H2,1-4H3;
54 atoms
O  0.124135 1.766418 1.571918
O  -1.103559 -2.720414 0.677718
C  -2.03976 1.51529 0.552361
C  -1.920034 -0.010938 0.519997
C  -1.281866 2.132759 1.72925
C  -3.509143 1.911776 0.459071
C  -2.401369 -0.498464 -0.849059
C  -0.511096 -0.447142 0.860134
C  -3.723506 0.099032 -1.256073
C  0.425874 0.482421 1.387183
C  -1.739232 1.642278 3.096947
C  -1.27119 3.648322 1.670322
C  -4.214707 1.165946 -0.636074
C  -0.135706 -1.820631 0.939459
C  1.726546 0.085314 1.720897
C  -4.436363 -0.595575 -2.376145
C  2.106056 -1.240787 1.631351
C  1.151002 -2.201675 1.289007
C  3.555161 -1.637219 1.738996
C  4.086292 -2.074176 0.359494
C  3.840998 -1.040595 -0.738345
C  3.858015 -1.575896 -2.1672
C  3.004625 -0.734691 -3.105514
H  -1.542784 1.900002 -0.349616
H  -2.596887 -0.438527 1.267743
H  -3.595358 2.983244 0.269701
H  -4.018664 1.731599 1.411604
H  -2.47303 -1.585157 -0.86768
H  -1.646246 -0.23095 -1.619716
H  -1.110855 2.079832 3.871474
H  -2.767888 1.944577 3.287499
H  -1.683947 0.557403 3.190156
H  -2.260227 4.0480 1.887837
H  -0.576327 4.042372 2.410576
H  -0.961475 3.998587 0.685505
H  -5.188216 1.543229 -0.930065
H  2.42335 0.848472 2.040902
H  -5.363624 -0.088418 -2.635925
H  -4.673805 -1.627621 -2.107721
H  -3.810949 -0.635438 -3.272108
H  1.412561 -3.254062 1.28726
H  4.136664 -0.796836 2.120128
H  3.677752 -2.459425 2.445799
H  3.595748 -3.010097 0.078775
H  5.151186 -2.298854 0.437521
H  -0.780229 -3.612465 0.818398
H  2.847929 -0.592692 -0.560581
H  4.529768 -0.198189 -0.635954
H  3.499373 -2.607845 -2.182876
H  4.880468 -1.603242 -2.548134
H  1.918664 -0.834959 -2.850967
H  3.266253 0.323522 -3.07126
H  3.057509 -1.0653 -4.142103
Ag 0.733322 -0.356022 -1.208322
totalener: -1115.66204953 hartree
nucrepener: 2519.30184647 hartree
electener: -3634.96389600 hartree
oneelecener: -6563.11510436 hartree
twoeener: 2928.15120836 hartree
kineticenergy: 1020.59900225 hartree
xcener: -106.975210552512 hartree
chargesum: 1.0000000
charge: -0.292560 -0.267981 -0.140484 0.263683 0.380986 -0.188571 -0.208653 -0.348992 -0.089135 0.321480 -0.342275 -0.271776 -0.124234 0.329033 -0.255082 -0.227353 -0.009867 -0.176511 -0.122637 -0.152935 -0.165921 -0.100887 -0.256944 0.086628 0.110599 0.099520 0.095059 0.124505 0.061886 0.117634 0.107893 0.103558 0.097017 0.112528 0.103466 0.105809 0.121797 0.092994 0.095580 0.082955 0.096677 0.095115 0.115343 0.073992 0.107598 0.191989 0.064192 0.121807 0.074386 0.099982 0.055536 0.132737 0.127988 0.370845
charge: 0.334922 0.393407 -0.054003 -0.044758 -0.218993 -0.007806 0.007839 -0.088982 -0.092642 -0.197608 0.036424 0.031657 0.000285 -0.181876 0.001479 0.021317 -0.065446 -0.020320 0.008167 -0.006289 -0.006513 -0.024619 0.044222 0.048635 0.053873 0.033228 0.032659 0.032604 0.030549 0.028360 0.024660 0.019576 0.025424 0.026489 0.022223 0.022102 0.035479 0.025305 0.022075 0.020374 0.027478 0.034581 0.036184 0.021669 0.029533 -0.094265 0.013526 0.031848 0.025355 0.032683 0.011211 0.028219 0.030124 0.398375
qa: -0.2926 -0.2680 -0.1405 0.2637 0.3810 -0.1886 -0.2087 -0.3490 -0.0891 0.3215 -0.3423 -0.2718 -0.1242 0.3290 -0.2551 -0.2274 -0.0099 -0.1765 -0.1226 -0.1529 -0.1659 -0.1009 -0.2569 0.0866 0.1106 0.0995 0.0951 0.1245 0.0619 0.1176 0.1079 0.1036 0.0970 0.1125 0.1035 0.1058 0.1218 0.0930 0.0956 0.0830 0.0967 0.0951 0.1153 0.0740 0.1076 0.1920 0.0642 0.1218 0.0744 0.1000 0.0555 0.1327 0.1280 0.3708
va: 2.1848 2.2242 3.9982 3.7586 3.6892 4.0217 3.9346 3.6728 3.8049 3.8790 3.9851 3.9208 3.8998 3.9195 4.0194 3.9604 3.7236 3.9211 3.8913 3.9320 3.8581 3.8687 3.9203 1.0215 1.0088 1.0056 1.0026 1.0266 1.0117 1.0104 1.0069 0.9960 1.0028 1.0130 1.0044 1.0128 1.0281 1.0097 0.9982 0.9975 1.0273 1.0131 1.0081 1.0118 1.0151 1.0454 0.9797 1.0076 1.0123 1.0123 1.0227 1.0067 1.0007 1.1841
dispcorr: -0.032759114 hartree
energy: -1115.707354261267
dipole: -47.04180 48.06096 1.01916 16.41117 -17.27124 -0.86007 78.31473 -78.88040 -0.56566
magnitude: 1.44858 au
magnitude: 3.68199 debye
temp: 298.15 k
press: 1.00 atm
zeropoint: 0.47237342 hartree
thermalvibcorrection: 0.02222157 hartree
thermalrotcorrection: 0.00141627 hartree
thermaltrasncorrection: 0.00141627 hartree
thermaltotal: -1115.20992673 hartree
thermalcorr: 0.02505411 hartree
nonthermalcorr: 0.47237342 hartree
totalcorr: 0.49742753 hartree
thermalcorrenthalpy: 0.00094421 hartree
totalenthalpy: -1115.20898252 hartree
totalentropycorr: -0.07666672 hartree
gibbsenthalpy: -1115.28564924 hartree
gibbsminuselec: 0.42170502 hartree
