program: Orca
programVersion: 5.0.2
elementType: O O C C C C C C C C C C C C C C C C C C C C C H H H H H H H H H H H H H H H H H H H H H H H H H H H H H H Ag
elementType: Ag
charge: 1
multiplicity: 1
keywords: wB97X-D3 Opt Freq def2-TZVPP def2/J RIJCOSX TightSCF defgrid3 CHELPG
frequency: 0.00 0.00 0.00 0.00 0.00 0.00 19.72 28.97 37.19 58.93 68.69 82.93 89.24 97.30 118.78 144.21 152.12 177.31 188.85 196.95 211.09 225.89 228.40 250.15 259.90 266.47 269.52 282.40 291.05 316.08 324.32 343.06 350.04 380.00 389.45 413.57 431.90 438.43 441.36 482.49 491.87 497.45 516.58 535.15 546.63 564.34 606.90 655.91 669.40 687.51 697.85 745.48 771.37 781.01 799.71 821.12 825.23 853.58 870.95 878.89 902.01 913.92 921.94 932.00 943.59 949.36 966.22 989.28 997.15 1010.39 1018.55 1030.77 1051.70 1053.83 1075.51 1086.54 1091.30 1096.60 1109.44 1120.74 1133.06 1148.50 1163.72 1171.15 1190.84 1198.53 1200.91 1204.67 1224.20 1237.09 1238.79 1273.12 1291.02 1295.52 1304.29 1324.39 1325.94 1346.08 1348.35 1351.74 1358.27 1362.35 1369.04 1375.23 1386.85 1398.93 1405.12 1408.97 1414.66 1420.61 1425.00 1431.73 1433.93 1481.36 1486.27 1487.02 1489.61 1492.03 1492.78 1495.87 1499.19 1501.08 1501.86 1505.76 1508.45 1511.11 1515.35 1526.67 1542.07 1624.55 1666.48 1780.06 2806.53 2945.93 3003.78 3036.55 3037.34 3045.49 3048.10 3051.14 3061.51 3061.55 3076.14 3077.87 3079.71 3081.70 3101.24 3101.76 3108.61 3121.65 3126.00 3130.06 3131.25 3140.30 3155.78 3156.09 3157.55 3166.69 3182.55 3185.78 3218.85 3892.01
frequency: 19.72 28.97 37.19 58.93 68.69 82.93 89.24 97.30 118.78 144.21 152.12 177.31 188.85 196.95 211.09 225.89 228.40 250.15 259.90 266.47 269.52 282.40 291.05 316.08 324.32 343.06 350.04 380.00 389.45 413.57 431.90 438.43 441.36 482.49 491.87 497.45 516.58 535.15 546.63 564.34 606.90 655.91 669.40 687.51 697.85 745.48 771.37 781.01 799.71 821.12 825.23 853.58 870.95 878.89 902.01 913.92 921.94 932.00 943.59 949.36 966.22 989.28 997.15 1010.39 1018.55 1030.77 1051.70 1053.83 1075.51 1086.54 1091.30 1096.60 1109.44 1120.74 1133.06 1148.50 1163.72 1171.15 1190.84 1198.53 1200.91 1204.67 1224.20 1237.09 1238.79 1273.12 1291.02 1295.52 1304.29 1324.39 1325.94 1346.08 1348.35 1351.74 1358.27 1362.35 1369.04 1375.23 1386.85 1398.93 1405.12 1408.97 1414.66 1420.61 1425.00 1431.73 1433.93 1481.36 1486.27 1487.02 1489.61 1492.03 1492.78 1495.87 1499.19 1501.08 1501.86 1505.76 1508.45 1511.11 1515.35 1526.67 1542.07 1624.55 1666.48 1780.06 2806.53 2945.93 3003.78 3036.55 3037.34 3045.49 3048.10 3051.14 3061.51 3061.55 3076.14 3077.87 3079.71 3081.70 3101.24 3101.76 3108.61 3121.65 3126.00 3130.06 3131.25 3140.30 3155.78 3156.09 3157.55 3166.69 3182.55 3185.78 3218.85 3892.01
formula: C21H30O2Ag
InChI: InChI=1S/C21H30O2.Ag/c1-5-6-7-8-15-12-18(22)20-16-11-14(2)9-10-17(16)21(3,4)23-19(20)13-15;/h9,12-13,16-17,22H,5-8,10-11H2,1-4H3;
54 atoms
O  -0.538205 -1.406674 0.998011
O  -1.476158 2.838734 -1.001777
C  -2.850872 -1.15133 0.424894
C  -2.610434 0.230574 -0.196864
C  -1.635425 -2.068071 0.302399
C  -4.154534 -1.729004 -0.111543
C  -3.698967 1.159469 0.367042
C  -1.1967 0.705579 0.067859
C  -5.081728 0.569216 0.228319
C  -0.272942 -0.135726 0.686361
C  -1.190926 -2.334271 -1.131249
C  -1.81937 -3.368813 1.060974
C  -5.264865 -0.722061 -0.022111
C  -0.741458 1.989205 -0.270379
C  1.025742 0.31641 1.049425
C  -6.216498 1.535816 0.384565
C  1.387246 1.670332 0.823335
C  0.508824 2.471555 0.122381
C  2.689759 2.243494 1.331181
C  3.759941 2.426196 0.237303
C  4.632028 1.187379 -0.009638
C  5.113865 1.024725 -1.450312
C  4.022155 0.546909 -2.402143
H  -2.98227 -0.994603 1.50183
H  -2.765255 0.147669 -1.281688
H  -4.435182 -2.61407 0.462595
H  -4.03693 -2.064492 -1.148082
H  -3.714971 2.140258 -0.115846
H  -3.483874 1.371841 1.420009
H  -0.28036 -2.935609 -1.128327
H  -1.952158 -2.894755 -1.671492
H  -1.006212 -1.413084 -1.686749
H  -2.555741 -4.001181 0.567938
H  -0.876661 -3.913534 1.101175
H  -2.149862 -3.177476 2.081509
H  -6.274575 -1.098105 -0.145679
H  1.578324 -0.289881 1.760399
H  -7.180905 1.036401 0.313677
H  -6.177737 2.315079 -0.380708
H  -6.165369 2.03944 1.353101
H  0.754072 3.498024 -0.117273
H  2.465933 3.213876 1.774929
H  3.084502 1.618963 2.135009
H  4.412095 3.254486 0.514679
H  3.264097 2.74211 -0.68507
H  -2.319994 2.452184 -1.241118
H  5.489823 1.218161 0.663733
H  4.096878 0.269352 0.288436
H  5.944141 0.318362 -1.483636
H  5.505916 1.977199 -1.813712
H  3.158701 1.223786 -2.417343
H  4.356996 0.468152 -3.435883
H  3.727528 -0.501715 -2.154487
Ag 2.097981 -0.33687 -0.842581
totalener: -1115.66429662 hartree
nucrepener: 2483.55026489 hartree
electener: -3599.21456151 hartree
oneelecener: -6491.38730984 hartree
twoeener: 2892.17274833 hartree
kineticenergy: 1020.59724846 hartree
xcener: -106.986409895456 hartree
chargesum: 1.0000000
charge: -0.296941 -0.254100 -0.129381 0.161820 0.403353 -0.186795 -0.215834 -0.180319 -0.066269 0.138036 -0.384760 -0.272898 -0.136149 0.171807 -0.124009 -0.220407 -0.039327 -0.116892 -0.176953 -0.191372 -0.072452 -0.184672 -0.116141 0.098858 0.102982 0.099048 0.086271 0.075339 0.106268 0.108185 0.122118 0.087321 0.096721 0.105075 0.113037 0.103068 0.224370 0.090276 0.086878 0.096140 0.135795 0.125956 0.103434 0.116233 0.096927 0.208833 0.121361 0.024884 0.096256 0.097000 0.080096 0.131094 0.020500 0.330333
charge: 0.332419 0.405203 -0.053454 -0.052897 -0.222644 -0.011628 0.001210 -0.067965 -0.092349 -0.192808 0.030505 0.032741 -0.006679 -0.165098 -0.068274 0.021383 -0.062525 -0.003988 0.010118 -0.010405 -0.017639 -0.020668 0.040463 0.052967 0.040238 0.032766 0.028835 0.021713 0.038775 0.024342 0.028426 0.016671 0.024975 0.023457 0.026226 0.020366 0.045426 0.024403 0.019699 0.024027 0.036691 0.040937 0.036939 0.030607 0.025269 -0.114558 0.033394 0.020466 0.029795 0.034498 0.028722 0.036289 0.029762 0.412857
qa: -0.2969 -0.2541 -0.1294 0.1618 0.4034 -0.1868 -0.2158 -0.1803 -0.0663 0.1380 -0.3848 -0.2729 -0.1361 0.1718 -0.1240 -0.2204 -0.0393 -0.1169 -0.1770 -0.1914 -0.0725 -0.1847 -0.1161 0.0989 0.1030 0.0990 0.0863 0.0753 0.1063 0.1082 0.1221 0.0873 0.0967 0.1051 0.1130 0.1031 0.2244 0.0903 0.0869 0.0961 0.1358 0.1260 0.1034 0.1162 0.0969 0.2088 0.1214 0.0249 0.0963 0.0970 0.0801 0.1311 0.0205 0.3303
va: 2.1828 2.2615 4.0413 3.7359 3.6489 3.9958 3.9306 3.4088 3.7758 3.9213 3.9626 3.9230 3.8998 4.0824 3.7925 3.9532 3.6879 3.9809 3.9424 3.8339 3.7156 4.0235 3.9058 1.0165 1.0004 1.0073 1.0028 1.0281 1.0016 1.0064 1.0158 0.9945 1.0021 1.0114 1.0060 1.0151 1.0110 1.0095 0.9988 0.9968 1.0145 1.0029 1.0048 1.0137 1.0037 1.0437 1.0013 1.0299 1.0120 1.0088 1.0175 1.0003 1.0178 1.2536
dispcorr: -0.031425308 hartree
energy: -1115.711217695820
dipole: -146.40200 147.94088 1.53888 33.63943 -33.83237 -0.19293 43.91026 -44.73671 -0.82645
magnitude: 1.75738 au
magnitude: 4.46691 debye
temp: 298.15 k
press: 1.00 atm
zeropoint: 0.47361786 hartree
thermalvibcorrection: 0.02187026 hartree
thermalrotcorrection: 0.00141627 hartree
thermaltrasncorrection: 0.00141627 hartree
thermaltotal: -1115.21289703 hartree
thermalcorr: 0.02470281 hartree
nonthermalcorr: 0.47361786 hartree
totalcorr: 0.49832067 hartree
thermalcorrenthalpy: 0.00094421 hartree
totalenthalpy: -1115.21195282 hartree
totalentropycorr: -0.07616496 hartree
gibbsenthalpy: -1115.28811777 hartree
gibbsminuselec: 0.42309992 hartree
