program: Gaussian 09
title: Product obtained with XRD.
version: ES64L-G09RevE.01
frameworkgroup: C1[X(C12H33BSi3)]
method: RwB97XD
basis: Gen
operation: Freq
keyword: #P
keyword: Geom=AllCheck
keyword: Guess=TCheck
keyword: SCRF=Check
keyword: GenChk
keyword: RwB97XD/ChkBas
keyword: Freq
converged: YES YES NO YES
title: Mulliken charges:
elementType: Si Si Si C H H C H H C H H C H H H C H H H C H H H C H H H C H H H C H H H C H H H C H H H C H H H B
charge: 0.738496 0.739601 0.777095 -0.571192 0.127077 0.124067 -0.572735 0.126566 0.129715 -0.579273 0.132490 0.120489 -0.584966 0.133201 0.132155 0.131722 -0.581273 0.130628 0.130148 0.131203 -0.580266 0.131642 0.132136 0.131648 -0.584100 0.130726 0.131533 0.133379 -0.581776 0.132508 0.132229 0.132552 -0.581005 0.130183 0.135325 0.132266 -0.600133 0.130865 0.132990 0.132943 -0.584186 0.131049 0.130950 0.132458 -0.586016 0.130669 0.132431 0.127458 0.414329
chargesum: -0.00000
title: Mulliken charges with hydrogens summed into heavy atoms:
elementType: Si Si Si C C C C C C C C C C C C B
charge: 0.738496 0.739601 0.777095 -0.320047 -0.316454 -0.326294 -0.187889 -0.189295 -0.184840 -0.188461 -0.184488 -0.183231 -0.203335 -0.189729 -0.195458 0.414329
polarizability: 2.17826028e+02 1.92496451e+00 2.10165144e+02 2.92800071e+00 -1.03385424e+00 1.74272046e+02
1716.lowfreq: -9.1317 -1.9402 0.0015 0.0016 0.0022 12.3775 26.0178 35.9979 47.8571
frequency: 25.4425 35.7069 47.7880 56.4187 67.2226 79.6563 97.0926 104.0647 115.4308 122.0347 150.0759 154.6098 156.7217 167.6929 172.9006 174.9394 179.6189 187.1525 190.4295 196.9597 197.4162 206.1079 210.8341 214.4869 218.9098 229.0071 235.7497 239.8182 240.3226 252.0841 259.0060 262.7450 265.9379 347.1059 389.4902 513.6494 580.4399 594.2007 625.0647 660.4015 673.8231 686.0449 690.1871 695.2430 697.9993 701.3410 703.2722 705.0207 706.7052 708.3412 710.6662 714.3781 722.9396 726.5729 767.2410 774.6410 784.0657 795.1483 811.5472 827.4193 831.5009 868.4694 872.7467 875.2255 878.2398 882.2479 888.5015 892.0146 897.5980 910.0007 978.4813 1017.0321 1026.7887 1067.2931 1080.4080 1121.7427 1226.8317 1244.1211 1311.6453 1313.0969 1314.5839 1315.1994 1316.7266 1318.2732 1321.1812 1325.6904 1327.2739 1436.7374 1445.1900 1451.8570 1467.3273 1469.2043 1470.1478 1471.3626 1472.7005 1474.3645 1476.3850 1477.8578 1480.2778 1482.2303 1483.7343 1484.7005 1487.7420 1488.4979 1490.2091 1494.8266 1496.0952 1499.0625 3051.8783 3054.9821 3059.8408 3060.6961 3061.4407 3061.4459 3061.8410 3062.1436 3062.8017 3064.7306 3067.0768 3069.9786 3112.8214 3116.7355 3120.8899 3146.6438 3147.3345 3148.1064 3148.4990 3148.7696 3149.0205 3149.4055 3150.1487 3150.3734 3150.4973 3151.3119 3151.7401 3152.3296 3153.4079 3154.8253 3155.2124 3166.8699 3170.1675
redmass: 2.9834 3.0157 3.1117 3.3104 2.6963 2.6976 3.2696 2.0702 1.7095 2.6395 2.2702 2.3989 2.3396 1.1069 1.1212 1.1002 1.1271 1.4951 1.2347 1.5855 1.2531 2.2020 1.8050 1.9828 1.9438 1.6953 1.7535 2.0275 1.8269 2.3507 2.3665 2.2970 2.4557 2.0825 2.0326 3.0569 3.7898 3.2692 2.8452 3.0991 1.7103 1.3986 1.3634 1.2439 1.1769 1.5364 2.1723 1.8445 1.9690 1.8417 2.6018 2.1874 2.3338 2.0769 1.6347 1.5717 1.7501 1.9051 1.5929 1.5508 1.4996 1.5194 1.5452 1.5943 1.5690 1.6766 1.7230 1.7317 1.8317 1.7381 1.2873 1.3845 1.1981 1.4840 1.4627 1.6386 2.5725 2.2861 1.2693 1.2679 1.2681 1.2666 1.2603 1.2654 1.2371 1.2357 1.2390 1.1257 1.1294 1.1468 1.0523 1.0529 1.0534 1.0535 1.0546 1.0529 1.0525 1.0525 1.0519 1.0489 1.0494 1.0508 1.0493 1.0513 1.0486 1.0465 1.0482 1.0465 1.0609 1.0579 1.0373 1.0519 1.0361 1.0358 1.0380 1.0377 1.0358 1.0366 1.0368 1.0368 1.0985 1.1025 1.1019 1.1011 1.1007 1.1005 1.1007 1.1005 1.1005 1.1010 1.1009 1.1008 1.1009 1.1005 1.1004 1.1006 1.1005 1.1010 1.1005 1.0993 1.0986
irintensity: 0.0091 0.0052 0.0166 0.0181 0.0286 0.0675 0.1791 0.0408 0.0719 0.1075 0.3388 0.2816 0.1800 0.0445 0.0158 0.0385 0.0682 0.1088 0.2607 0.1650 0.1562 1.1413 0.9629 0.4566 0.4645 0.7212 1.2914 6.0431 3.1003 0.8406 2.8600 0.8467 1.2786 8.1967 0.8371 6.4596 1.0640 0.0637 5.3539 1.9926 10.8234 2.7486 3.5974 0.1237 0.0109 2.1629 10.6577 6.5682 0.6299 10.5164 2.9958 1.3421 18.1855 17.9663 7.4490 2.7913 10.5488 1.1246 8.8053 5.9086 11.9313 67.6404 10.8821 62.8032 176.6890 125.8560 88.7071 85.5301 369.1781 49.5990 51.0625 111.7566 40.3657 96.0153 95.7526 156.9595 197.9275 223.9346 67.8750 37.3668 30.8583 38.1457 4.1598 41.9999 27.0552 26.0588 29.9584 18.2921 8.0210 10.5767 0.4739 0.6600 0.3069 1.1055 0.8518 1.5846 1.7854 4.5577 0.3498 1.9539 3.8263 5.4281 11.3211 7.2932 0.2003 11.8018 5.3404 8.8858 3.4690 8.1676 4.7947 6.0703 2.2128 12.9954 8.7458 3.7216 6.5843 4.4348 9.3097 5.0021 12.8316 15.4217 20.8363 0.5461 6.0045 5.1978 14.3477 9.7056 32.4556 9.1291 2.9873 7.4767 14.0872 49.4418 27.3390 5.4059 20.3548 22.4079 19.2046 8.1773 12.0033
temp: 298.150 k
press: 1.00000 atm
elementType: 14 14 14 6 1 1 6 1 1 6 1 1 6 1 1 1 6 1 1 1 6 1 1 1 6 1 1 1 6 1 1 1 6 1 1 1 6 1 1 1 6 1 1 1 6 1 1 1 5
symmnumber: 1
zpe: 1119015.1 jmol-1
zpe.correction: 0.426210 hartree
zpe.thermalcorrener: 0.454148 hartree
zpe.thermalcorrenthalpy: 0.455092 hartree
zpe.thermalcorrgfe: 0.369529 hartree
zpe.sumelectzpe: -1370.067348 hartree
zpe.sumelectthermal: -1370.039411 hartree
zpe.sumelectthermalent: -1370.038467 hartree
zpe.sumelectthermalfe: -1370.124030 hartree
dipole: 0.1389 -0.1373 -0.0479
dipole: 0.2011
quadrupole: -125.8615 -126.9065 -126.8691
quadrupole: -0.0900 -0.4962 0.0384
quadrupole: 0.6842 -0.3608 -0.3234 -0.0900 -0.4962 0.0384
hfenergy: -1370.4935588 hartree
pointgroup: C01 [X(C12H33B1Si3)]
dipole: -0.0105158 0.0286968 -0.0729789 debye
polarizability: 187.71995|7.9499355|210.728126|18.7369786|-0.600344|203.8151415 unknown
InChI: InChI=1S/C12H33BSi3/c1-14(2,3)10-13(11-15(4,5)6)12-16(7,8)9/h10-12H2,1-9H3
charge 0 multiplicity 1
49 atoms
Si 5.26801026 11.88365303 15.50378903
Si 2.59442861 9.75120683 11.36691004
Si 4.13212197 7.36492942 15.27395897
C  5.12827512 11.19726282 13.74461046
H  6.1638832 11.04564042 13.41054907
H  4.68260962 11.99933575 13.14168328
C  2.79314948 9.9229063 13.24342289
H  2.17771964 9.12270725 13.67364092
H  2.33246827 10.88529896 13.50412469
C  4.99662084 8.48958694 14.01843171
H  4.9936275 7.88580355 13.09755501
H  6.04805642 8.61944958 14.30126835
C  6.28417158 10.71260949 16.57826171
H  5.85248392 9.70830961 16.61192154
H  7.30319429 10.61987979 16.18754983
H  6.35384946 11.08251029 17.60652935
C  3.54932839 12.13259985 16.23678762
H  2.96131741 12.81764215 15.61628908
H  2.99702473 11.19085399 16.30547648
H  3.60755269 12.56234879 17.24226719
C  6.14752479 13.55096701 15.43827622
H  6.2462369 13.98384547 16.43951638
H  7.15278945 13.4524757 15.01561004
H  5.59418809 14.2651719 14.81963423
C  3.30723314 8.10511264 10.7818463
H  4.4014849 8.10289238 10.81998862
H  2.94925545 7.27679677 11.40294076
H  3.01169556 7.89949901 9.74767239
C  0.75524022 9.80031448 10.95313481
H  0.59153447 9.73105142 9.87238918
H  0.22455409 8.96715846 11.42573716
H  0.2952787 10.73046984 11.30256291
C  3.47600858 11.16531951 10.4863115
H  3.0784967 12.13550157 10.80314599
H  4.5487403 11.16009924 10.70495906
H  3.35286609 11.09269264 9.40066129
C  3.13833057 8.31307337 16.56974867
H  2.32184645 8.87771467 16.1076645
H  2.69419366 7.61506679 17.28760217
H  3.75577616 9.01848463 17.13453753
C  5.44177239 6.3313611 16.15403367
H  6.12576807 6.97101121 16.72237711
H  4.99032317 5.6200058 16.85343693
H  6.04034557 5.76249416 15.43491719
C  2.94665645 6.21616036 14.35643575
H  3.47593438 5.64233035 13.58789338
H  2.47642085 5.50291497 15.04162298
H  2.14591712 6.77534524 13.86057637
B  4.30016234 9.86602948 13.68109565
