program: Gaussian 09
title: Vibrate 0.5.
version: ES64L-G09RevE.01
frameworkgroup: C1[X(C30H74BLiN4Si3)]
method: RwB97XD
basis: Gen
operation: Freq
keyword: #P
keyword: Geom=AllCheck
keyword: Guess=TCheck
keyword: SCRF=Check
keyword: GenChk
keyword: RwB97XD/ChkBas
keyword: Freq
converged: YES YES NO YES
title: Mulliken charges:
elementType: N N N C H H H C C H H C H H C H H H C H H C H H C H H H Li H H H C H H H C C C C H H H H H H H H C C C C C H H H H H H H H H H N Si Si Si C H H C H C C H H H B C H H H C H H H C H H H C H H H C H H H C H H H C H H H H H H C H H H
charge: -0.538924 -0.513210 -0.486167 -0.188927 0.152261 0.146041 0.143315 -0.074585 -0.079326 0.151705 0.140599 -0.068286 0.150484 0.135207 -0.187701 0.174619 0.147643 0.118948 -0.072292 0.135356 0.110237 -0.206053 0.125124 0.154609 -0.209868 0.126911 0.137060 0.161617 -0.053935 0.147858 0.144884 0.134546 -0.189784 0.160731 0.153603 0.145313 0.141176 0.148226 -0.336576 -0.332471 0.096755 0.099150 0.132864 0.125592 0.167138 0.150111 0.085252 0.097033 -0.203219 -0.334751 -0.214236 -0.335186 -0.231048 0.115490 0.104732 0.175438 0.102694 0.114681 0.103167 0.115115 0.162564 0.115113 0.119604 -0.684922 0.717732 0.763037 0.761620 -0.569464 0.085298 0.118831 -0.590542 0.093861 -0.491356 -0.582457 0.134201 0.094993 0.121029 0.344674 -0.574558 0.099027 0.126682 0.120071 -0.567443 0.121864 0.111231 0.097790 -0.584783 0.123967 0.135758 0.117374 -0.581484 0.105578 0.127593 0.100449 -0.581760 0.115501 0.134730 0.114859 -0.578001 0.143128 0.112364 0.112345 -0.577833 0.118737 0.117880 0.118261 0.051099 0.380786 0.104035 -0.587739 0.141073 0.126767 0.124093
chargesum: -0.00000
title: Mulliken charges with hydrogens summed into heavy atoms:
elementType: N N N C C C C C C C C Li C C C C C C C C C C N Si Si Si C C C C B C C C C C C C C
charge: -0.538924 -0.513210 -0.486167 0.252690 0.218158 0.212978 0.217405 0.253509 0.173301 0.208226 0.215720 -0.053935 0.269864 0.141176 0.148226 0.048678 0.040265 0.009027 0.048113 -0.000405 0.045660 0.003669 -0.304136 0.717732 0.763037 0.761620 -0.365334 -0.392645 -0.440256 -0.232234 0.344674 -0.228779 -0.236559 -0.207683 -0.247864 -0.216669 -0.210165 -0.222955 -0.195806
chargesum: 0.00000
polarizability: 4.91634562e+02 6.59591371e+00 4.24581364e+02 5.61415244e+00 7.61686669e+00 4.11083329e+02
1716.lowfreq: -10.0588 -7.2624 -0.0014 -0.0005 0.0013 4.6843 19.2095 25.2037 29.9588
redmass: 3.9731 3.8112 3.3292 3.6307 3.8862 4.0034 3.9793 2.7418 3.4041 4.0224 3.1984 3.4111 3.4571 3.7833 3.5342 3.2737 3.0980 3.4945 3.3393 2.4563 3.3748 2.4289 2.1685 2.9304 2.5934 1.5601 1.7108 1.6429 1.7611 1.1682 1.4068 1.8576 2.3500 2.0414 2.2525 1.9149 1.4730 1.2752 1.7735 1.2033 1.3743 2.0761 2.4082 2.0888 2.0862 2.3486 2.4724 1.7901 2.1027 1.7502 1.8260 2.1046 1.4643 1.9524 2.1223 1.5591 1.7456 1.3874 1.7618 2.0515 1.4257 1.7578 2.0418 2.5847 2.9388 1.7696 2.1785 2.2645 1.6363 1.6221 1.4577 1.9512 1.4919 1.7974 1.9945 1.3594 2.5362 2.9887 1.8680 2.1938 1.9802 2.1217 1.9777 2.1100 2.5009 2.1668 2.4212 2.6683 2.7476 2.6918 3.6023 2.5099 2.2358 3.1749 2.8280 3.4071 3.1081 2.1254 1.9748 1.8714 1.3148 1.2925 2.2027 1.5465 1.4025 1.8867 2.2057 2.4674 2.7890 1.8522 1.5291 1.6592 1.4894 1.5433 1.5535 2.4242 1.7716 2.2171 1.7137 1.6994 2.5049 2.7009 1.5910 1.5367 1.5077 1.6077 1.5606 1.5747 1.6875 1.8734 1.7235 1.7912 1.8506 2.6907 2.0072 2.0308 1.8993 1.6320 1.5118 2.1738 1.5674 2.1329 1.8635 1.5766 1.2689 1.6978 1.5813 1.2668 1.3781 1.6635 1.8888 2.0144 1.9245 1.5684 1.4812 1.5561 1.5753 1.6275 1.8277 1.5714 1.3636 1.8162 1.2833 1.3038 1.3120 1.6712 1.6422 1.9143 1.5951 1.6550 1.6035 1.9987 2.1918 2.0855 1.7027 1.9812 2.2712 1.8885 2.5011 1.2720 1.3443 1.2771 1.6881 1.2779 1.2988 1.6879 1.2975 1.3518 1.3951 1.5349 1.6151 1.4340 1.5824 1.9280 1.3085 4.2462 1.4276 1.4198 1.5432 1.8084 1.3566 1.1106 1.3337 1.3035 1.3290 1.2275 1.4693 1.1564 1.2079 1.4135 1.1644 1.1651 1.0546 1.0553 1.0558 1.0589 1.1636 1.0730 1.0547 1.0522 1.0537 1.0496 1.0563 1.0511 1.0515 1.0700 1.0503 1.0697 1.1083 1.0685 1.0753 1.0897 1.0584 1.0704 1.0893 1.0619 1.0841 1.0694 1.0487 1.0550 1.0543 1.0729 1.0717 1.0586 1.0779 1.0724 1.0646 1.0744 1.0724 1.0643 1.0618 1.0800 1.0713 1.0636 1.0696 1.0687 1.0518 1.0609 1.2162 1.0727 1.0577 1.0587 1.0716 1.0729 1.0573 1.0571 1.0713 1.0576 1.0624 1.0336 1.0374 1.0607 1.0380 1.0377 1.0358 1.0358 1.0354 1.0368 1.0375 1.0482 1.0443 1.0815 1.0514 1.0603 1.0419 1.0525 1.0554 1.0831 1.0902 1.0877 1.0971 1.0996 1.1010 1.0801 1.0764 1.0860 1.0992 1.1026 1.0990 1.0996 1.0992 1.1004 1.0822 1.1001 1.1008 1.0999 1.1004 1.1012 1.0807 1.1000 1.1002 1.1004 1.0995 1.1006 1.0807 1.0986 1.1015 1.1004 1.0999 1.1007 1.0984 1.1001 1.1027 1.0940 1.0942 1.0969 1.0989 1.1047 1.1011 1.1012 1.0919 1.1004 1.0893
irintensity: 0.0445 0.1114 0.4932 0.4449 0.3519 3.6937 3.2154 0.0715 0.1136 0.6444 0.2976 0.3889 0.4613 0.4758 0.2476 1.0527 0.5397 1.5611 1.5600 1.3385 2.5706 0.9262 0.9608 1.4015 0.8278 0.2575 0.5354 0.2181 0.4985 0.3453 0.0859 0.0489 4.8090 0.3225 0.3482 0.1824 0.1171 0.8618 0.6529 0.0916 1.7694 11.7202 0.3984 16.2792 1.6000 3.1609 3.1106 5.4268 10.1696 0.2551 3.9479 14.0387 1.3541 0.9344 2.1759 2.0468 20.6454 8.9197 7.9482 18.5696 6.7526 17.9848 12.7222 41.0478 3.3094 2.5600 31.2289 1.2542 3.3793 11.6801 5.7011 8.3340 2.6023 4.0903 1.2827 4.3374 3.7559 28.0601 2.4620 4.5548 2.9485 1.4325 7.2320 3.6145 3.9431 4.7947 0.0720 0.6470 0.1189 3.3665 1.6514 7.8279 1.3864 5.4497 4.0280 9.0139 2.2730 6.0223 4.1444 8.4988 1.6949 0.7377 9.5305 4.1494 16.3124 6.4648 4.9597 6.0642 7.3181 13.3954 80.0719 21.0491 1.7240 17.7376 16.9001 3.9577 7.2726 3.1637 6.7604 25.9117 12.6367 76.7815 3.2428 89.6961 41.4986 70.4402 55.0543 39.0320 41.7737 57.4196 113.5756 196.2151 238.3384 6.7451 65.6063 83.7832 1.6504 0.7391 0.2399 19.7747 1.0123 13.8415 73.7914 2.1312 3.5955 5.5139 21.3348 64.3486 16.3108 7.9182 14.7127 17.5549 9.0232 17.5267 4.1156 12.3382 2.7392 134.5807 25.7369 11.9858 2.6249 0.6119 1.7372 1.6699 38.8215 24.3286 16.8231 22.7146 61.3975 38.5601 8.1809 22.2878 4.7151 0.8368 29.1874 36.5738 7.0840 2.2376 1.1778 19.6964 26.1567 47.0398 15.0926 40.6955 41.3180 9.3348 47.8529 9.7465 33.6575 21.0047 7.2006 4.3659 12.7078 29.6208 14.0878 390.1311 27.6919 6.0093 0.2220 6.9246 15.8526 3.8108 12.4987 0.7070 28.3372 29.8731 4.1392 6.1422 7.9103 0.6777 2.2777 0.0371 1.8587 0.9698 2.6368 0.5630 2.4361 2.7031 0.5603 1.7160 0.5351 12.0866 0.9233 3.7090 3.8430 1.2862 0.4798 0.8395 3.5592 0.4066 0.9083 1.9897 1.9503 3.9840 7.7649 5.9957 5.6495 6.7720 6.6342 14.5695 5.0536 2.5348 5.2480 12.5622 16.9663 9.0217 8.0757 9.0239 10.8310 20.2141 32.7441 7.0872 18.5380 5.8661 11.3060 18.8734 4.8555 2.6179 7.5474 29.3240 38.1921 158.6899 31.9535 89.6762 54.1616 43.4726 85.7887 108.7679 14.2622 9.7343 13.3663 14.9617 31.6414 24.2939 15.7375 12.4509 13.8000 8.2964 9.3149 2.0057 10.3656 43.8011 53.1132 48.4331 27.2627 3.4719 51.1961 35.9838 12.7020 1.3305 47.1456 37.1557 26.4621 4.2361 34.8733 42.7826 2.8734 12.5266 45.6233 93.4391 20.4132 25.5003 22.1922 7.6331 36.0569 34.1561 21.6872 8.3692 7.4854 6.3897 1.9365 48.7842 46.0036 37.6143 8.6481 30.9468 11.0099 13.7557 2.7263 20.4537 44.7493 19.2097 6.7197 27.0652 10.7931 12.9917 13.5803 6.6759 11.1896 7.6339 175.1442 56.8331 282.8644
temp: 298.150 k
press: 1.00000 atm
elementType: 7 7 7 6 1 1 1 6 6 1 1 6 1 1 6 1 1 1 6 1 1 6 1 1 6 1 1 1 3 1 1 1 6 1 1 1 6 6 6 6 1 1 1 1 1 1 1 1 6 6 6 6 6 1 1 1 1 1 1 1 1 1 1 7 14 14 14 6 1 1 6 1 6 6 1 1 1 5 6 1 1 1 6 1 1 1 6 1 1 1 6 1 1 1 6 1 1 1 6 1 1 1 6 1 1 1 1 1 1 6 1 1 1
symmnumber: 1
zpe: 2690893.1 jmol-1
zpe.correction: 1.024907 hartree
zpe.thermalcorrener: 1.081450 hartree
zpe.thermalcorrenthalpy: 1.082394 hartree
zpe.thermalcorrgfe: 0.938244 hartree
zpe.sumelectzpe: -2306.441287 hartree
zpe.sumelectthermal: -2306.384744 hartree
zpe.sumelectthermalent: -2306.383799 hartree
zpe.sumelectthermalfe: -2306.527950 hartree
dipole: -15.0115 3.3751 2.4887
dipole: 15.5862
quadrupole: -265.1498 -268.8608 -272.3785
quadrupole: -5.1135 4.2414 -3.5896
quadrupole: 3.6466 -0.0645 -3.5821 -5.1135 4.2414 -3.5896
hfenergy: -2307.4661938 hartree
pointgroup: C01 [X(C30H74B1Li1N4Si3)]
dipole: -5.913588 1.5115618 0.5893496 debye
polarizability: 491.5245558|8.8706533|428.0790519|1.413016|1.4643716|407.6956469 unknown
InChI: InChI=1S/C12H32BSi3.C9H23N3.C9H19N.Li/c1-14(2,3)10-13(11-15(4,5)6)12-16(7,8)9;1-10(2)6-8-12(5)9-7-11(3)4;1-8(2)6-5-7-9(3,4)10-8;/h10H,11-12H2,1-9H3;6-9H2,1-5H3;10H,5-7H2,1-4H3;
charge 0 multiplicity 1
113 atoms
N  -2.04598718 2.54914465 -0.76745223
N  -4.27774254 -1.13453744 -1.95225933
N  -4.32175724 1.03844362 0.33245946
C  -4.37165465 1.05934561 1.79620282
H  -5.34405573 1.42093513 2.17009349
H  -3.58877972 1.70870165 2.19313295
H  -4.19360431 0.05703425 2.18612538
C  -3.1604646 3.20854192 -0.08473682
C  -4.45589232 2.41277306 -0.17297229
H  -5.24315651 2.95328053 0.37909096
H  -4.78157145 2.3783225 -1.21374923
C  -5.4164321 0.18700402 -0.16488289
H  -6.38621481 0.68017296 0.0244693
H  -5.41492797 -0.7297185 0.43293139
C  -2.32449426 2.40889859 -2.1993297
H  -1.41271205 2.11244343 -2.71703306
H  -2.68534132 3.35463021 -2.63749993
H  -3.06579337 1.62616577 -2.37052938
C  -5.33342007 -0.1800051 -1.64499151
H  -6.32510121 -0.55809919 -1.95754383
H  -5.1618902 0.72191992 -2.24082995
C  -4.67671784 -2.4981336 -1.62851649
H  -5.00080283 -2.576433 -0.58869344
H  -3.82405104 -3.16984698 -1.75815557
C  -3.89441364 -1.07255189 -3.35637547
H  -3.52761341 -0.07408546 -3.6073002
H  -4.73023757 -1.3212259 -4.035008
H  -3.07939796 -1.77709343 -3.54071321
Li -2.1708155 0.4252542 0.08170379
H  -3.3467709 4.21226947 -0.50753142
H  -2.87354448 3.35924309 0.96159629
H  -5.50324128 -2.85022558 -2.27263319
C  -0.82233583 3.33618765 -0.59872035
H  0.03554452 2.7675234 -0.96530288
H  -0.87473804 4.29203884 -1.14506627
H  -0.65652024 3.55431968 0.45715216
C  -0.45611439 0.07791429 2.72243158
C  -1.61146182 -2.08019413 1.96577691
C  -0.3027416 1.47768318 2.13219362
C  -2.51228667 -2.47282171 0.79568284
H  -2.29826611 0.69023489 3.67589904
H  -3.42665332 -1.52238609 3.00308705
H  0.1682269 2.16668532 2.83975346
H  -3.01875395 -3.42412215 0.99027168
H  0.32465418 1.43678388 1.23498866
H  -1.93840363 -2.58094888 -0.12778652
H  -1.28538203 1.88584981 1.86390313
H  -3.27693825 -1.70533487 0.631616
C  -1.39722549 0.11965625 3.93372882
C  0.94106844 -0.40712979 3.14808513
C  -2.47520277 -2.01582478 3.23791471
C  -0.52518398 -3.16067033 2.12110417
C  -1.81552505 -1.27327043 4.3950087
H  -0.89805215 0.66509532 4.74216303
H  0.91210866 -1.34646571 3.70229428
H  1.56834748 -0.54832698 2.26677169
H  1.41088548 0.34106984 3.79526336
H  -2.72834229 -3.0419148 3.52757958
H  -0.986703 -4.1537755 2.11800185
H  0.03268257 -3.06045111 3.05347645
H  0.18833275 -3.10510039 1.29607394
H  -2.51235013 -1.20128807 5.23665015
H  -0.94717906 -1.83126837 4.76177799
N  -1.06193592 -0.73533314 1.62617059
Si 0.70649432 -1.6712294 -1.83025707
Si 3.26555058 2.74321858 -0.54543414
Si 5.25659718 -1.29189236 0.03515363
C  2.59390639 1.09619924 -1.13958875
H  1.59289699 1.24997557 -1.57172282
H  3.22536474 0.85451253 -2.01105127
C  3.849514 -0.34605333 0.85654147
H  4.2365539 0.60425015 1.2453011
C  1.64208024 -1.33270585 -0.31585601
C  2.64837406 3.23511646 1.1768242
H  2.76036693 2.40763444 1.88506109
H  1.59197532 3.52190084 1.16236991
H  3.21632469 4.09007786 1.55965445
B  2.61904001 -0.21603895 -0.17294746
C  2.7627751 4.12472702 -1.74682264
H  1.67622069 4.21507581 -1.85219508
H  3.17251376 3.92965502 -2.74405887
H  3.14548701 5.09644286 -1.41497289
C  1.62167201 -1.41507599 -3.47668666
H  2.51658309 -2.04628654 -3.51358502
H  1.94882523 -0.37679657 -3.59471692
H  0.99277158 -1.67084832 -4.33861557
C  5.15666053 2.76031337 -0.51466649
H  5.56133086 2.55824283 -1.512459
H  5.57127335 2.01369075 0.16837034
H  5.52609374 3.74335258 -0.20134802
C  0.05535118 -3.45865321 -1.92251035
H  -0.36423137 -3.80968756 -0.97396434
H  0.87729154 -4.13660513 -2.17811215
H  -0.71355914 -3.57212573 -2.69723139
C  5.47460495 -0.85442114 -1.79046303
H  5.67194687 0.21285972 -1.93244188
H  4.57013175 -1.10833899 -2.35330197
H  6.31262264 -1.41197304 -2.22317253
C  4.90502923 -3.14369695 0.13884057
H  3.93271605 -3.35353413 -0.3184145
H  4.86968146 -3.48732221 1.17841327
H  5.66783721 -3.72902547 -0.386064
C  6.89634853 -0.92687762 0.91273274
H  6.82402113 -1.13427971 1.98588683
H  7.17303536 0.12723501 0.79651461
H  7.71482752 -1.53190961 0.50716872
H  1.8459822 -2.21655439 0.30117545
H  -0.28666098 -0.89337991 0.95335268
H  3.58407151 -0.96060292 1.72872474
C  -0.81430401 -0.51043908 -1.98313153
H  -1.71946088 -0.94499764 -1.53981257
H  -0.55086338 0.42098736 -1.46713187
H  -1.06671489 -0.25759382 -3.01847625
