program: Gaussian 09
title: Product obtained with XRD.
version: ES64L-G09RevE.01
frameworkgroup: C1[X(C21H55BN3NaSi3)]
method: RwB97XD
basis: Gen
operation: Freq
keyword: #PGeom=AllCheck
keyword: Guess=TCheck
keyword: SCRF=Check
keyword: GenChk
keyword: RwB97XD/ChkBas
keyword: Freq
converged: YES YES NO YES
title: Mulliken charges:
elementType: Si Si Si N N C H H N C H C C C H H H C C H H C H H H C H H H B C H H C H H H C H H H C H H H C H H H C H H H C H H H C H H H C H H C H H H C H H C H H H Na H H H H H H H H
charge: 0.758295 0.758454 0.769796 -0.696490 -0.648951 -0.571602 0.084215 0.091222 -0.654690 -0.585184 0.109511 -0.599172 -0.174737 -0.210135 0.141580 0.174301 0.146506 -0.052520 -0.058559 0.136607 0.126134 -0.582818 0.118416 0.118795 0.117985 -0.588014 0.137774 0.117196 0.121819 0.608933 -0.064780 0.142915 0.133492 -0.582954 0.121234 0.118964 0.116139 -0.582742 0.122410 0.134514 0.121474 -0.576965 0.122178 0.118855 0.118005 -0.580669 0.111941 0.121481 0.124842 -0.580825 0.121723 0.137225 0.121469 -0.584074 0.139892 0.116818 0.122756 -0.183892 0.139748 0.141867 0.099985 -0.055828 0.138957 0.135151 -0.580673 0.110237 0.123446 0.127157 -0.211358 0.144229 0.157001 -0.211753 0.154851 0.146149 0.162384 0.446379 0.101261 0.099250 0.128394 0.153956 0.097835 0.094456 0.046956 0.143871
chargesum: -0.00000
title: Mulliken charges with hydrogens summed into heavy atoms:
elementType: Si Si Si N N C N C C C C C C C C B C C C C C C C C C C C C Na
charge: 0.758295 0.758454 0.769796 -0.696490 -0.648951 -0.396165 -0.654690 -0.428716 -0.406881 0.025773 0.252252 0.229830 0.204182 -0.227621 -0.211225 0.608933 0.211626 -0.226618 -0.204343 -0.217928 -0.222406 -0.200408 -0.204608 0.197708 0.218280 -0.219833 0.233744 0.251631 0.446379
chargesum: 0.00000
polarizability: 3.49552172e+02 1.33708778e+00 3.29049858e+02 3.37470328e+00 4.93499821e-02 3.15096097e+02
1716.lowfreq: -8.7551 -0.0004 0.0010 0.0016 5.8389 10.7483 20.6681 27.9588 42.3192
frequency: 19.9862 27.8914 42.2324 45.4807 48.0502 53.1145 59.6097 61.7849 68.4457 76.7178 80.2050 86.6944 95.9949 122.3583 131.5441 137.8549 142.4100 144.3052 149.0227 156.9391 164.1635 168.2383 176.2103 179.4379 184.9806 190.3438 194.1346 200.5634 203.8826 205.9335 207.2429 209.2921 210.7358 212.2006 216.9857 218.7613 225.5637 228.4545 234.8889 240.6072 242.8721 252.3787 260.5277 264.1330 267.2301 269.7405 279.8981 284.1013 289.3203 292.9189 300.3187 316.6275 331.4879 343.5737 374.9633 379.5687 393.6518 401.0819 415.2369 429.2300 440.5078 456.5374 461.1943 467.7735 501.9977 559.7516 584.6279 602.6429 604.7838 611.7816 628.7547 644.7134 665.8212 673.4368 684.9664 686.5372 689.0920 690.8407 691.1602 693.6672 697.9352 701.5819 706.1889 708.9285 736.9181 762.1981 773.2249 779.6230 782.7393 784.3352 788.6054 794.1858 804.0371 809.3653 817.2101 836.0130 859.8171 861.0078 868.8083 871.9560 874.5946 875.3696 894.4829 901.0230 910.0888 919.9169 931.4568 949.4622 961.3487 982.1173 987.7986 1020.1329 1053.9672 1067.1775 1069.9093 1075.7986 1076.9118 1085.5310 1101.3636 1107.9187 1115.4989 1130.2737 1138.9269 1146.7713 1153.1028 1163.6022 1171.9646 1180.8606 1192.3699 1212.1582 1224.5828 1265.5969 1284.8619 1299.4804 1301.6445 1304.2810 1305.1016 1307.5839 1310.1085 1310.5506 1313.9850 1316.2390 1318.4067 1320.4836 1329.4190 1337.8366 1344.0768 1359.9282 1370.6665 1401.9681 1416.6245 1436.5920 1444.1601 1446.4908 1449.1132 1467.4580 1469.4935 1470.8779 1471.2579 1472.1406 1475.8226 1476.3660 1476.6427 1478.3736 1479.9096 1481.6563 1481.9441 1484.7759 1485.6168 1487.4409 1488.3189 1490.8224 1491.8413 1492.7566 1494.3479 1494.7895 1499.1427 1501.5991 1503.3737 1503.7969 1504.3411 1508.7798 1513.6475 1515.5898 1517.1872 1519.0515 1521.2048 1525.2833 1526.6510 1532.3462 1534.7083 2919.7875 2965.4752 2973.9443 2983.8160 2988.9694 2991.3881 2993.8018 2996.0896 2999.4364 3008.6056 3011.3318 3020.9747 3039.6753 3043.5019 3046.0193 3053.4923 3054.2670 3055.3192 3059.2880 3060.5401 3064.5221 3065.7222 3070.4201 3074.1223 3076.5114 3082.6796 3099.7523 3107.8359 3111.5740 3112.0292 3119.2051 3122.7382 3126.5349 3130.5260 3133.5456 3134.0094 3134.4608 3136.6345 3140.1746 3141.0876 3143.4442 3143.6220 3144.5410 3144.7226 3146.5985 3147.6045 3149.8481 3151.8061 3155.6854 3155.9140 3156.4461 3162.4415 3168.4686 3173.9661 3177.7553
redmass: 3.9356 3.7568 3.0566 3.1854 3.8665 3.3987 3.1247 3.3142 3.2753 3.5272 3.7699 2.9764 3.8699 3.3811 1.2851 2.7715 2.7529 3.4621 2.5478 2.2788 3.1690 2.7315 2.4596 2.9911 1.4560 1.7625 1.0768 1.3087 1.2152 1.5182 1.4530 2.1826 1.9364 1.6399 2.6179 2.4651 2.3696 2.3789 2.6440 1.3377 3.2530 2.1409 1.2337 2.2594 1.6753 1.3107 1.3830 1.5217 2.2095 1.2296 1.9572 1.5410 2.2754 2.3775 2.1166 2.9203 1.9940 2.3007 1.9432 1.9248 2.2691 2.0807 2.0684 2.1910 2.3928 3.1203 2.5778 2.7531 3.2023 2.8327 3.0680 1.6847 1.8913 1.6325 1.3535 1.5906 1.3667 1.9111 1.6698 1.9622 2.2197 2.0567 2.1945 2.1426 1.9282 1.5348 1.5174 1.6456 1.8193 2.1897 1.8535 1.8027 1.9235 1.6858 2.7895 2.2977 1.5087 1.5622 1.5399 1.6022 1.5762 1.5799 1.8691 1.8261 1.7628 2.0525 2.3222 2.1754 2.7921 2.2518 2.6119 2.2127 2.2828 2.0459 1.3592 1.4168 1.3804 1.5268 1.8432 1.6368 1.5190 1.5684 1.3136 1.7406 1.6261 1.5204 1.4570 1.5569 1.5944 1.6325 1.6179 2.2808 2.3569 1.2647 1.2659 1.2932 1.2634 1.2605 1.3017 1.3834 1.2498 1.5445 1.2508 1.2846 1.4893 1.4774 1.2815 1.5531 1.5542 1.3667 1.3786 1.4051 1.0817 1.0909 1.3928 1.1457 1.0580 1.0604 1.1573 1.0738 1.0556 1.0568 1.0553 1.0596 1.0552 1.0811 1.0750 1.1021 1.0561 1.1011 1.0514 1.0563 1.0538 1.0545 1.0509 1.0486 1.0495 1.0857 1.0486 1.0497 1.0979 1.1056 1.0930 1.0518 1.0588 1.0780 1.0961 1.0517 1.0591 1.0761 1.0555 1.0667 1.0732 1.0535 1.0696 1.0539 1.0554 1.0562 1.0668 1.0678 1.0731 1.0674 1.0873 1.0592 1.0374 1.0365 1.0378 1.0363 1.0357 1.0383 1.0377 1.0380 1.0369 1.0829 1.0916 1.0857 1.0961 1.0900 1.0833 1.0823 1.0824 1.0911 1.0979 1.0998 1.0892 1.0979 1.0985 1.0998 1.1006 1.1008 1.1000 1.0999 1.1000 1.1010 1.1003 1.1003 1.0900 1.0999 1.1041 1.1035 1.1003 1.1002 1.1013 1.0987 1.0980 1.0987
irintensity: 1.1944 0.1492 0.3127 0.1094 1.4331 1.4602 0.1767 0.3623 0.6663 0.1699 1.5872 0.0575 1.7213 0.3862 0.2989 0.3780 0.2907 0.4099 0.6312 0.9172 1.3211 0.3499 0.4725 1.2677 1.6026 2.7506 0.2334 1.5151 0.6539 2.5692 1.9497 4.0609 3.4441 1.3012 1.7314 2.5905 3.4531 0.9216 1.9178 0.4800 9.1223 0.0475 0.4240 3.5236 2.4382 0.2501 4.5383 2.4999 5.4828 0.2498 5.6979 0.3258 4.7186 6.5703 7.7926 6.3294 4.7231 4.3958 6.8220 9.2460 3.7618 0.5527 1.4892 6.0117 1.9164 2.5096 5.7125 6.0135 5.2498 5.5523 2.5774 8.1185 4.8972 0.6086 2.0838 1.7563 5.7344 8.3440 8.0197 11.4938 6.7634 3.4813 5.6117 3.4836 9.5860 6.1604 23.2595 2.3052 6.7916 9.2146 15.2966 12.1902 7.9777 4.7933 24.7210 12.3404 9.4694 46.9797 108.1911 26.1398 20.3944 86.9697 209.5662 285.7319 121.3658 23.2159 71.0423 123.2691 108.5913 21.2187 56.0935 29.0887 13.0286 0.7364 12.7577 30.0020 2.8550 16.9752 13.7455 9.5776 15.0874 98.6824 6.5145 30.7763 93.8393 2.8630 23.1380 29.6790 23.3751 18.0987 8.0270 1.8624 2.6355 37.2541 45.1990 22.9735 41.2990 35.7377 41.2726 17.3320 16.6571 16.2086 27.2150 31.5921 1.8487 5.8162 6.3686 29.1708 23.7482 15.1858 18.9953 1.6696 0.7401 2.1589 2.4116 2.3993 1.0957 1.1187 0.5377 4.7725 2.2010 0.2390 0.4699 1.3040 0.2398 1.8752 0.7683 3.4617 2.4525 1.0454 1.5013 1.9047 10.1694 3.4642 3.1772 6.1483 11.2103 4.5900 2.7411 13.1728 3.3710 3.1436 15.2906 11.2298 7.7422 7.2278 6.3605 22.9814 24.2342 17.9008 16.1522 93.8446 32.0651 70.8171 2.4580 47.5380 42.0028 73.9828 98.9121 152.1244 157.0436 71.7642 31.8157 24.1869 20.1178 15.7397 11.3063 8.4944 14.3546 14.1288 5.7307 12.2307 9.3115 17.9696 45.7342 49.2445 44.1484 3.4543 24.4855 2.4710 48.1928 26.7392 27.2858 24.1570 11.4082 51.1044 1.1848 28.6587 10.8166 20.3678 2.8608 43.8313 32.6375 4.8659 35.4439 46.2986 18.6729 25.1626 15.2176 17.3698 21.1166 17.1165 15.4458 8.1542 12.6531 7.8974
temp: 298.150 k
press: 1.00000 atm
elementType: 14 14 14 7 7 6 1 1 7 6 1 6 6 6 1 1 1 6 6 1 1 6 1 1 1 6 1 1 1 5 6 1 1 6 1 1 1 6 1 1 1 6 1 1 1 6 1 1 1 6 1 1 1 6 1 1 1 6 1 1 1 6 1 1 6 1 1 1 6 1 1 6 1 1 1 11 1 1 1 1 1 1 1 1
symmnumber: 1
zpe: 1965351.4 jmol-1
zpe.correction: 0.748563 hartree
zpe.thermalcorrener: 0.792181 hartree
zpe.thermalcorrenthalpy: 0.793125 hartree
zpe.thermalcorrgfe: 0.675374 hartree
zpe.sumelectzpe: -2052.384647 hartree
zpe.sumelectthermal: -2052.341029 hartree
zpe.sumelectthermalent: -2052.340085 hartree
zpe.sumelectthermalfe: -2052.457836 hartree
dipole: 10.7546 -0.9419 -0.0312
dipole: 10.7958
quadrupole: -195.8575 -213.8838 -214.2225
quadrupole: -2.5593 -1.5777 1.3548
quadrupole: 12.1305 -5.8959 -6.2346 -2.5593 -1.5777 1.3548
hfenergy: -2053.1332097 hartree
pointgroup: C01 [X(C21H55B1N3Na1Si3)]
dipole: 0.3680947 -2.8698906 3.1094218 debye
polarizability: 328.4872931|-0.7190794|333.7543313|-3.3056455|-17.1796513|331.4565036 unknown
InChI: InChI=1S/C21H55BN3Si3.Na/c1-23(2)14-15-24(3)16-17-25(4)18-22(19-26(5,6)7,20-27(8,9)10)21-28(11,12)13;/h14-21H2,1-13H3;
charge 0 multiplicity 1
84 atoms
Si 1.64840953 5.02300935 8.58617046
Si 5.96256024 7.38906933 7.24098335
Si 5.80916382 2.94977996 6.54534767
N  5.43541442 4.8055145 11.29823081
N  3.88355253 1.29926199 12.15511674
C  4.63981405 6.08332164 7.50490054
H  3.74031984 6.69504428 7.6732626
H  4.45590818 5.6006551 6.53298704
N  6.76964138 2.05532188 11.6235552
C  5.95198047 3.83195214 8.20078889
H  6.89993218 4.38728569 8.13290797
C  3.27144467 4.17081614 8.98608709
C  5.17234378 5.6836053 10.11097129
C  7.81595003 1.55706771 10.73493614
H  8.71875343 1.23990461 11.28448247
H  8.10006491 2.33872081 10.026297
H  7.44307852 0.70847846 10.15349995
C  6.86880193 4.54970086 11.43998967
C  7.18743598 3.30789191 12.27463862
H  8.26848594 3.28231225 12.4902471
H  6.68867866 3.38665949 13.24422237
C  7.74770886 6.83016007 7.5429764
H  8.02961508 6.01074266 6.87399341
H  7.89796017 6.48993683 8.57299655
H  8.43903413 7.66094865 7.36140515
C  1.53615308 6.68651451 9.48107181
H  2.31111994 7.38614718 9.15446912
H  1.65730378 6.54397927 10.56169891
H  0.56189796 7.15972628 9.31702771
B  4.7687126 4.92622713 8.68850398
C  6.34096918 1.03310331 12.57827917
H  7.05587846 0.92843162 13.41335971
H  6.33611499 0.06973377 12.05755505
C  5.62688492 8.86808074 8.37770314
H  5.62855951 8.57784749 9.43326086
H  4.64523791 9.3026606 8.15732195
H  6.37661155 9.65556893 8.24225438
C  1.29516352 5.24427968 6.74523154
H  1.23726974 4.27314674 6.24171229
H  2.06941289 5.8343432 6.24863253
H  0.33418263 5.74990166 6.59820083
C  5.89000508 8.0376749 5.46171467
H  4.8824982 8.38911467 5.2132973
H  6.15372931 7.25692836 4.73972475
H  6.58310705 8.87313247 5.31223571
C  0.24753311 3.94454843 9.28186541
H  0.35068654 3.81690035 10.36654135
H  0.25469274 2.94814589 8.82472779
H  -0.73705367 4.38695007 9.09463716
C  6.64062243 3.93913047 5.1675394
H  7.7013731 4.10138388 5.38773949
H  6.17266323 4.92141603 5.05154863
H  6.5742159 3.41917746 4.20575011
C  4.03778314 2.57306982 6.00288191
H  3.43478126 3.48526237 5.97881996
H  3.54153883 1.86552918 6.67682417
H  4.03102953 2.13343011 4.99936334
C  4.88878256 5.3855766 12.51631248
H  3.80765184 5.5112668 12.40736979
H  5.32524342 6.37536317 12.74149468
H  5.06158396 4.73511398 13.38248416
C  4.95144904 1.30582354 13.15975925
H  4.74891953 0.57231408 13.95977641
H  4.9498403 2.29228816 13.63391518
C  6.70958771 1.28239706 6.68371129
H  6.232673 0.64426846 7.43920106
H  7.75508293 1.42318182 6.98144202
H  6.7026371 0.73035979 5.7377276
C  3.5037646 -0.05408009 11.76408093
H  4.36708838 -0.59790391 11.37253439
H  2.74984975 -0.00932753 10.97325294
C  2.71537453 2.04715869 12.61716406
H  3.00432178 3.07939104 12.83631252
H  2.2624356 1.60731377 13.52173588
H  1.9587876 2.07027398 11.82723609
Na 4.76823276 2.69907572 10.42240019
H  4.32399719 6.32911027 10.37638541
H  6.03064377 6.36980149 10.00639205
H  7.38506465 5.41915017 11.88836355
H  7.28663671 4.42589186 10.43745035
H  3.17892611 3.16700223 8.53344163
H  3.10510647 4.03038062 10.07504638
H  6.21611343 3.02274866 8.90536082
H  3.08648311 -0.62885858 12.60886333
