program: Gaussian 09
title: predicted intermediate.
version: ES64L-G09RevE.01
frameworkgroup: C1[X(C30H74BN4NaSi3)]
method: RwB97XD
basis: Gen
operation: Freq
keyword: #PGeom=AllCheck
keyword: Guess=TCheck
keyword: SCRF=Check
keyword: GenChk
keyword: RwB97XD/ChkBas
keyword: Freq
converged: YES YES NO YES
title: Mulliken charges:
elementType: N N N C H H H C C H H C H H C H H H C H H C H H C H H H Na H H H C H H H C C C C H H H H H H H H C C C C C H H H H H H H H H H N Si Si Si C H H C H C C H H H B C H H H C H H H C H H H C H H H C H H H C H H H C H H H H H H C H H H
charge: -0.691735 -0.666444 -0.609259 -0.208087 0.138030 0.158473 0.162419 -0.054650 -0.060350 0.138406 0.120896 -0.072580 0.137664 0.141377 -0.192688 0.143368 0.141334 0.118348 -0.051024 0.137464 0.117850 -0.193830 0.149116 0.164787 -0.209048 0.138265 0.141230 0.161245 0.481187 0.132417 0.155173 0.134430 -0.193294 0.148530 0.129734 0.195346 0.168478 0.172025 -0.321951 -0.308065 0.090776 0.089938 0.090422 0.089473 0.087457 0.071022 0.116065 0.113691 -0.196802 -0.326060 -0.194723 -0.326918 -0.223824 0.076180 0.097699 0.070352 0.097737 0.077050 0.097357 0.103082 0.069724 0.094522 0.089625 -0.671348 0.774057 0.751603 0.765975 -0.579797 0.122008 0.132348 -0.590372 0.111527 -0.572401 -0.582489 0.128525 0.144589 0.126403 0.416236 -0.590578 0.151591 0.129443 0.126354 -0.598143 0.136107 0.132012 0.129452 -0.580005 0.127678 0.133479 0.127671 -0.584063 0.125949 0.135730 0.127851 -0.576298 0.125819 0.122433 0.126001 -0.594092 0.126139 0.140666 0.125325 -0.587562 0.139587 0.126599 0.124655 0.135976 0.114450 0.199748 -0.583765 0.121213 0.127610 0.129670
chargesum: -0.00000
title: Mulliken charges with hydrogens summed into heavy atoms:
elementType: N N N C C C C C C C C Na C C C C C C C C C C N Si Si Si C C C C B C C C C C C C C
charge: -0.691735 -0.666444 -0.609259 0.250836 0.232941 0.198952 0.206461 0.210363 0.204289 0.254504 0.231693 0.481187 0.280316 0.168478 0.172025 -0.028006 -0.033879 -0.029846 -0.060273 -0.027735 -0.056756 -0.039677 -0.671348 0.774057 0.751603 0.765975 -0.325441 -0.279097 -0.321975 -0.182972 0.416236 -0.183190 -0.200573 -0.191177 -0.194533 -0.202044 -0.201962 -0.196721 -0.205272
chargesum: 0.00000
polarizability: 4.66458485e+02 -4.92598006e-01 4.36998780e+02 -1.03021198e+00 -2.93348375e+00 4.18525410e+02
1716.lowfreq: -2.3235 -1.0577 -0.0016 -0.0004 0.0011 9.6151 16.4959 23.6899 28.3355
redmass: 3.9377 3.9974 4.4586 3.6997 3.6716 3.4207 4.1371 3.3914 3.7760 3.8504 3.5515 3.3538 3.2398 4.0306 3.2995 3.4460 3.5228 3.4367 3.4297 3.3173 3.0868 2.9528 3.2514 2.8638 3.1172 2.8762 1.2403 2.4676 1.6748 1.5630 1.5453 2.4328 2.4286 1.0987 2.7626 1.1928 1.3234 1.2415 5.7292 1.8183 1.3795 1.5162 2.2654 3.3150 1.7198 1.6014 1.8720 2.0741 2.1809 2.1758 1.6569 1.6555 1.9711 1.7884 1.2976 2.0983 2.3091 1.9052 2.2767 1.4199 2.0694 1.2027 1.4715 1.3302 1.2241 1.4501 2.0801 1.4570 1.7877 1.7416 1.6840 1.4978 2.0470 2.0726 2.1841 2.2088 2.3711 2.5256 2.4554 1.9736 1.9631 1.8067 2.1350 1.9810 2.1359 2.2888 2.7982 2.7934 3.4555 3.6972 2.4411 3.8000 2.9293 3.2293 2.2972 3.1202 2.9813 1.6182 1.2006 1.2765 1.4146 1.5012 1.4486 1.9573 2.1930 2.3900 1.8305 1.8586 2.2927 2.7175 2.1202 2.0215 2.8321 1.6251 1.5755 2.4330 1.6280 1.8787 1.6443 2.6457 3.0034 1.5296 1.4831 1.6479 2.0878 1.4972 1.5367 1.5988 1.6211 1.6227 2.0046 2.0596 1.7517 1.7237 1.4203 1.7461 1.7876 1.9553 1.8422 1.6953 2.3084 2.2193 1.3514 1.5121 1.2761 1.4200 1.3972 2.1671 1.2194 2.0957 1.6685 1.9489 1.6309 1.7728 1.6404 1.5664 1.4027 1.4890 1.6825 1.4201 1.9861 1.9115 1.6256 1.2731 1.2998 1.8555 1.3489 2.0333 1.5087 2.4830 1.5331 2.1108 1.9799 2.4166 3.1502 2.4521 1.8471 2.5986 2.5629 2.3253 2.2644 1.2751 1.2906 1.2797 1.9503 1.2698 2.1747 1.2865 1.2632 1.2418 1.2438 1.2414 1.2563 1.5069 1.3354 1.5439 1.4573 1.4371 1.2858 1.4443 1.5297 1.4657 1.4195 1.2519 1.3238 1.2868 1.1296 1.4488 1.1310 1.3455 1.1453 1.1676 1.1597 1.0543 1.0579 1.0545 1.0545 1.0551 1.0527 1.0556 1.1131 1.0552 1.0525 1.0869 1.0493 1.0581 1.0721 1.0682 1.0548 1.0571 1.0870 1.0588 1.0695 1.0553 1.0631 1.0663 1.0775 1.0652 1.0560 1.0555 1.0821 1.0627 1.0584 1.0825 1.0656 1.1002 1.0710 1.0650 1.0781 1.0502 1.0598 1.0746 1.0884 1.0550 1.0707 1.0664 1.0581 1.0905 1.0792 1.0710 1.0712 1.0549 1.0594 1.0618 1.0591 1.0557 1.0622 1.0740 1.0603 1.0412 1.0386 1.0420 1.0508 1.0533 1.0595 1.0361 1.0378 1.0362 1.0552 1.0626 1.0357 1.0371 1.0386 1.0578 1.0374 1.0374 1.0364 1.0993 1.1005 1.0989 1.1011 1.1013 1.0881 1.0967 1.0808 1.0805 1.0867 1.0971 1.0868 1.1025 1.0837 1.0895 1.0913 1.0981 1.0774 1.1003 1.1007 1.0983 1.0976 1.0933 1.1003 1.0994 1.1004 1.1005 1.1006 1.1004 1.1010 1.1009 1.0999 1.1003 1.1013 1.1006 1.1036 1.1035 1.1003 1.0937 1.1027 1.0999 1.0985 1.0976 1.0969 1.0983 1.1038
irintensity: 0.3990 0.2773 0.2019 0.6532 0.1886 0.2158 0.7899 0.0735 0.4621 0.5288 1.2142 0.0820 0.3652 2.3070 0.9532 0.4657 0.7201 0.7920 0.3145 0.4867 0.2409 0.1243 0.6248 1.9211 0.0317 1.0112 0.3303 1.4797 0.3446 0.5424 0.0498 1.5733 1.4789 0.0153 0.8958 0.0708 0.5059 0.1590 10.1722 0.1116 0.1114 0.3181 0.7195 10.9776 0.5174 1.1257 5.2486 5.1345 0.2907 3.0501 0.4713 1.2649 3.4945 6.8687 0.7497 0.1220 2.1097 1.4308 4.7059 0.9286 0.2427 0.9353 0.3868 1.7303 0.1294 2.6262 0.9913 2.5191 0.3420 1.2998 0.0898 0.4618 4.4320 4.5570 3.7659 2.2281 10.0353 3.0960 0.1855 7.7216 5.4080 1.9957 0.3741 1.7503 3.9630 1.2574 3.5764 0.5762 6.3901 31.1636 6.3015 0.9444 5.4438 1.5288 1.0428 8.0619 1.2285 5.0957 0.2291 0.3101 1.1238 5.1114 1.7250 9.7457 11.0186 4.2741 8.4959 4.7625 0.8618 1.0179 21.6377 17.2422 0.0815 8.5624 5.2982 8.0699 8.7994 1.0739 7.0242 21.9083 30.0926 13.2276 4.1121 0.6460 24.6620 36.9748 43.1028 25.7018 127.2981 188.7351 46.6020 29.2487 54.6080 366.7130 3.9514 108.8454 1.1363 6.3409 0.0415 5.4660 29.8609 16.1749 45.3085 6.8288 1.4049 29.5460 63.2956 23.4806 33.8912 6.6801 33.1887 17.7619 53.2537 12.4991 10.1478 15.4337 87.1615 16.1913 2.9173 2.4202 21.6263 11.8374 99.3796 2.3162 3.3798 33.9004 2.7331 50.8043 23.9297 29.0283 12.8793 12.6324 11.2965 171.7108 4.8917 206.8003 10.9361 14.5480 9.2453 0.4175 81.4568 45.7836 51.0776 30.6955 7.9173 35.2733 2.7567 35.6575 27.5829 15.0467 31.9525 28.6513 15.0569 4.7353 5.1312 30.9211 17.3208 0.0379 0.3421 7.0881 1.2712 17.7184 15.9615 12.4687 12.1318 4.7699 17.7816 9.8252 6.4637 5.2432 19.6632 0.2734 1.9528 0.7160 0.9592 0.2954 0.5319 0.8950 0.4394 1.1637 2.1136 1.0326 3.5507 0.3397 3.9191 4.1882 5.0200 3.3944 0.5221 0.4151 4.0782 0.4054 5.9481 5.9418 7.1458 7.3924 0.7753 2.8772 12.5390 2.7801 5.9789 4.2365 5.8999 3.3716 4.2857 3.5054 12.9601 13.8502 7.1029 8.4244 29.6521 13.5584 5.8777 14.2819 32.7909 3.9590 12.5525 21.8421 7.3526 2.7424 19.8411 42.1304 20.2526 44.3800 88.7586 203.9326 164.0547 96.8863 18.0894 54.4135 29.3080 74.0991 19.8912 23.6422 94.8721 11.8262 4.2407 6.8112 15.7508 31.0808 9.3551 0.4259 12.6186 4.3240 12.1202 15.5886 7.1311 36.9327 60.7225 6.3070 10.3698 27.6363 3.7175 160.2288 10.9265 15.0240 47.7248 87.1756 42.7612 18.3308 4.5523 25.6821 25.4186 13.5120 15.2523 17.1662 3.2041 19.7286 17.2118 40.8517 17.3041 69.2943 10.7149 18.0639 12.2901 47.6912 5.5942 12.6616 16.8574 24.2211 22.7541 12.4212 21.3209 23.1964 20.0627 32.6472 7.0151 16.7675 0.9057 15.2235 6.8024 7.5003 11.8064
temp: 298.150 k
press: 1.00000 atm
elementType: 7 7 7 6 1 1 1 6 6 1 1 6 1 1 6 1 1 1 6 1 1 6 1 1 6 1 1 1 11 1 1 1 6 1 1 1 6 6 6 6 1 1 1 1 1 1 1 1 6 6 6 6 6 1 1 1 1 1 1 1 1 1 1 7 14 14 14 6 1 1 6 1 6 6 1 1 1 5 6 1 1 1 6 1 1 1 6 1 1 1 6 1 1 1 6 1 1 1 6 1 1 1 6 1 1 1 1 1 1 6 1 1 1
symmnumber: 1
zpe: 2677388.7 jmol-1
zpe.correction: 1.019763 hartree
zpe.thermalcorrener: 1.077574 hartree
zpe.thermalcorrenthalpy: 1.078518 hartree
zpe.thermalcorrgfe: 0.929727 hartree
zpe.sumelectzpe: -2461.190012 hartree
zpe.sumelectthermal: -2461.132201 hartree
zpe.sumelectthermalent: -2461.131257 hartree
zpe.sumelectthermalfe: -2461.280048 hartree
dipole: 7.1073 5.8991 1.0435
dipole: 9.2953
quadrupole: -246.4152 -280.4339 -275.3921
quadrupole: 12.3886 4.0381 -0.2640
quadrupole: 20.9986 -13.0202 -7.9784 12.3886 4.0381 -0.2640
hfenergy: -2462.2097751 hartree
pointgroup: C01 [X(C30H74B1N4Na1Si3)]
dipole: 2.8509318 -0.753043 -2.1631125 debye
polarizability: 462.2647753|-13.0262125|423.8913466|4.118075|4.6971969|435.8265539 unknown
InChI: InChI=1S/C12H33BSi3.C9H23N3.C9H18N.Na/c1-14(2,3)10-13(11-15(4,5)6)12-16(7,8)9;1-10(2)6-8-12(5)9-7-11(3)4;1-8(2)6-5-7-9(3,4)10-8;/h10-12H2,1-9H3;6-9H2,1-5H3;5-7H2,1-4H3;/q;;-1;+1
charge 0 multiplicity 1
113 atoms
N  2.36410472 0.90190661 -1.52789523
N  5.12048545 0.03154988 1.09723996
N  3.4523377 -1.83466068 -0.65495399
C  2.65619529 -3.0448852 -0.46998051
H  3.06228373 -3.899639 -1.039004
H  1.62881177 -2.87205225 -0.80014131
H  2.61673696 -3.31093603 0.58970009
C  2.15920642 -0.38091928 -2.20298514
C  3.33103522 -1.34438786 -2.03335771
H  3.20840252 -2.1868088 -2.73409248
H  4.25950392 -0.84615601 -2.32366556
C  4.83989644 -2.06553707 -0.25376003
H  5.38332778 -2.66691449 -1.00540708
H  4.82335406 -2.66627696 0.66093186
C  3.2879028 1.76188025 -2.25335856
H  3.43986413 2.68817959 -1.69247486
H  2.91542959 2.02235741 -3.26009342
H  4.26303239 1.27949723 -2.36594247
C  5.62836445 -0.78080243 -0.00756517
H  6.68917104 -1.04857316 0.15305441
H  5.60121248 -0.16084382 -0.90985177
C  5.43830313 -0.55418289 2.39665653
H  5.00090118 -1.55053792 2.48642746
H  5.00454009 0.05981308 3.1888525
C  5.64587126 1.39051752 1.0130526
H  5.333015 1.84949545 0.07002297
H  6.74843797 1.42003858 1.06844356
H  5.24616187 1.9914988 1.83401826
Na 2.65388011 0.09684546 0.77567842
H  1.95844568 -0.23346008 -3.28020556
H  1.25901903 -0.83881961 -1.78018293
H  6.52799263 -0.63120054 2.55950701
C  1.08166197 1.57556505 -1.32147539
H  1.24878315 2.57237529 -0.90605177
H  0.51337907 1.68359784 -2.26176868
H  0.48254771 1.02350967 -0.59016627
C  1.1524849 1.52817259 3.08867267
C  0.65751023 -0.90288103 2.87379862
C  0.96893187 2.77198912 2.20382617
C  -0.00040084 -1.78312539 1.79997287
H  -0.84088199 1.85257797 3.8225767
H  -1.33013409 -0.60393202 3.66883397
H  1.07424786 3.7044586 2.77293315
H  -0.18822474 -2.8076081 2.14750489
H  1.72097808 2.78098903 1.40219607
H  0.64306889 -1.83485549 0.91356461
H  -0.01832212 2.74895097 1.73245408
H  -0.94612828 -1.33430048 1.48832655
C  0.14190239 1.62622628 4.25411234
C  2.58942393 1.64329521 3.68742401
C  -0.3276964 -0.80799859 4.06623974
C  1.927333 -1.67824629 3.35179889
C  0.03869372 0.31670585 5.02968993
H  0.39843094 2.45872811 4.92296461
H  2.81720013 0.82939912 4.3808759
H  3.32627018 1.60268583 2.87476844
H  2.74213243 2.58900308 4.22497244
H  -0.38585217 -1.76888323 4.59480606
H  1.68739729 -2.68714042 3.7147985
H  2.4559553 -1.15547228 4.1531015
H  2.63203926 -1.79097227 2.51490239
H  -0.71451904 0.39714757 5.8235342
H  0.9888418 0.09704914 5.53475106
N  0.93970287 0.37235917 2.23796129
Si -3.11855115 3.41747311 -1.59068676
Si -3.2817641 -1.57020968 -1.25154086
Si -3.83809642 1.87071999 2.72124082
C  -4.09375941 0.06824559 -0.7496128
H  -4.43164634 0.55160891 -1.67510176
H  -4.98027196 -0.20999525 -0.16395567
C  -2.88689839 0.67475439 1.61377621
H  -3.23158535 -0.32439393 1.91456262
C  -2.23029367 2.05062172 -0.63555699
C  -3.40261141 -2.82308764 0.14986813
H  -4.44586993 -2.99802863 0.43285051
H  -2.86253585 -2.48516072 1.03889397
H  -2.97216882 -3.78392329 -0.15268389
B  -3.0919236 0.94585228 0.08847713
C  -1.45771645 -1.3204785 -1.68105821
H  -0.91386915 -0.92178963 -0.81783572
H  -1.32859474 -0.62601924 -2.51907098
H  -0.99739057 -2.27581716 -1.9598865
C  -4.8577359 3.78389801 -0.9590099
H  -4.85824378 4.1199526 0.08230813
H  -5.49215182 2.89346283 -1.02469557
H  -5.32485702 4.57042707 -1.56167928
C  -4.16546694 -2.25696946 -2.77131339
H  -4.08694783 -1.56690756 -3.61833292
H  -5.2298747 -2.41638517 -2.56982676
H  -3.73574555 -3.21619624 -3.07966401
C  -2.0759185 4.98660374 -1.48195679
H  -1.07679028 4.81551166 -1.89779314
H  -1.94969143 5.29927249 -0.43973495
H  -2.53210199 5.81749124 -2.03029603
C  -5.66158481 1.88166421 2.22921888
H  -6.08121196 0.87228031 2.30588595
H  -5.80781215 2.22133938 1.19996307
H  -6.24725276 2.53489734 2.88488046
C  -3.11076355 3.6069518 2.58917338
H  -3.10661477 3.96445742 1.55475831
H  -2.07486418 3.61798516 2.94392778
H  -3.68131643 4.32272932 3.19056465
C  -3.74071544 1.28158036 4.51044193
H  -2.70846976 1.24196785 4.86935511
H  -4.16443387 0.27603182 4.60587068
H  -4.30501124 1.94646038 5.17356415
H  -1.4885659 2.49439062 0.03868375
H  -1.66920549 1.53162071 -1.42627086
H  -1.82345038 0.77629318 1.88476072
C  -3.26023831 2.8990276 -3.40290643
H  -2.26978895 2.71953434 -3.83591735
H  -3.84004422 1.97563399 -3.50943563
H  -3.7530669 3.67176495 -4.00237056
