program: Gaussian 16
title: Title Card Required
version: ES64L-G16RevC.01
frameworkgroup: C1[X(C28H63BN3NaOSi3)]
method: RwB97XD
basis: Gen
operation: Freq
keyword: #P
keyword: Geom=AllCheck
keyword: Guess=TCheck
keyword: SCRF=Check
keyword: GenChk
keyword: RwB97XD/ChkBas
keyword: Freq
converged: YES YES NO NO
title: Mulliken charges:
elementType: Si Si Si Na O N N C C C C H H N C H C C H H H C H H H B C H C H H H C H C H C H H H C H H H C H H H C H H H C H H H C H H H C H H H C H H C H H H C H H C H H H C H H C H H H C H H H C H H H C H H H H H H
charge: 0.743617 0.770596 0.739960 0.453379 -0.541907 -0.654175 -0.616987 -0.655345 -0.036298 -0.542145 -0.582844 0.112752 0.168538 -0.674631 -0.177450 0.109441 0.331339 -0.580395 0.127446 0.124703 0.127215 -0.578224 0.137347 0.119347 0.129817 0.338312 -0.180397 0.108609 -0.578659 0.127157 0.128867 0.123802 -0.128845 0.110415 -0.136565 0.116138 -0.574684 0.119908 0.112541 0.117045 -0.591008 0.129457 0.123069 0.139479 -0.610134 0.145737 0.144750 0.110877 -0.566159 0.115564 0.112712 0.098440 -0.565597 0.127481 0.105874 0.120474 -0.120597 0.118615 0.144897 0.112639 -0.585819 0.123751 0.098667 0.120079 -0.067109 0.124910 0.143365 -0.191941 0.146856 0.142712 0.115048 -0.061933 0.133054 0.158989 -0.194721 0.151739 0.140195 0.141598 -0.065633 0.154697 0.136999 -0.205478 0.129594 0.143020 0.161048 -0.188215 0.169559 0.132242 0.158934 -0.185133 0.151121 0.133642 0.157849 -0.053370 0.113419 0.137134 0.073266 0.043475 0.181771 0.125313
chargesum: -0.00000
title: Mulliken charges with hydrogens summed into heavy atoms:
elementType: Si Si Si Na O N N C C C C N C C C C B C C C C C C C C C C C C C C C C C C C C
charge: 0.743617 0.770596 0.739960 0.453379 -0.541907 -0.654175 -0.616987 -0.486557 -0.036298 -0.287108 -0.301554 -0.674631 -0.068010 0.331339 -0.201032 -0.191714 0.338312 -0.071788 -0.198834 -0.018430 -0.020427 -0.225189 -0.199003 -0.208770 -0.239443 -0.211768 0.255554 -0.243322 0.201166 0.212675 0.230110 0.238811 0.226062 0.228184 0.272520 0.257479 0.197183
polarizability: 4.22145088e+02 -7.48758756e+00 4.27132566e+02 4.54545512e+00 -3.43065866e+00 4.07595757e+02
1716.lowfreq: -1103.0731 -3.8763 -0.0005 0.0007 0.0009 2.2730 2.4719 8.3260 16.4307
redmass: 1.1061 3.5874 4.0375 3.3038 3.5040 3.8476 4.0086 3.5266 3.4354 4.5311 4.2349 3.4586 3.6341 4.1988 3.3973 3.1913 3.4813 4.0820 4.1301 3.4248 2.9499 2.7841 2.9633 1.6149 1.8380 2.2372 1.9374 1.2618 2.6437 1.0716 2.8090 2.5791 2.0746 2.1696 1.4262 3.0747 1.6650 2.5496 1.6776 2.3542 1.7399 2.5046 2.3116 2.1595 2.1267 2.2735 1.6220 1.8523 2.1231 2.0244 1.2125 1.4425 1.7043 1.9633 1.9387 1.5539 1.3877 1.6964 1.2791 1.9750 1.8625 1.9398 1.5641 1.9247 2.1544 1.9291 3.2283 2.4274 2.7448 2.3688 2.2165 2.1468 2.0603 1.9161 2.1600 2.0610 3.4853 2.1480 3.4743 3.3174 3.1807 2.8869 2.8271 2.5418 2.8378 4.4361 3.3727 3.1475 3.3153 1.4774 1.7217 2.3852 1.2879 2.3772 1.6288 1.7743 1.1928 2.1339 2.3424 2.8255 2.2097 1.5345 1.4058 2.3651 1.4653 1.7370 1.6911 1.6354 1.7798 2.3219 2.1941 2.5583 3.0241 2.9435 1.8944 1.4521 1.3951 1.4539 1.5562 1.6245 1.6487 1.4798 1.6297 1.6222 1.6091 1.8347 2.0133 1.9962 1.8727 1.3382 1.3576 2.2403 2.1887 1.2711 2.1816 1.5054 2.1014 2.0169 1.6635 1.5456 2.4288 1.5356 1.6643 2.7195 2.0189 1.7583 1.2786 1.3678 2.1889 1.5551 1.5451 1.6276 1.2765 1.4526 1.1074 1.6247 1.4492 1.8439 2.7331 1.6323 2.8475 1.2668 2.1955 1.2740 1.2677 1.9674 1.2748 1.3018 1.7768 1.3482 1.2845 2.2265 2.4281 1.2909 1.2430 1.4257 1.3495 1.5090 2.6481 1.4758 2.6223 1.4217 1.3115 1.1018 1.1462 1.4494 1.4057 1.1764 1.1620 1.0559 1.0543 1.0542 1.0569 1.0554 1.0584 1.0545 1.0538 1.1282 1.0956 1.4344 1.0797 1.0664 1.0514 1.0590 1.1079 1.0540 1.1199 1.0535 1.0511 1.0530 1.0763 1.0465 1.0924 1.1350 1.4068 1.0584 1.0878 1.0944 1.0586 1.0768 1.0831 1.0549 1.0803 1.0989 1.0931 1.0634 1.0772 1.0906 1.1526 1.9444 6.0853 6.2138 1.0715 1.0709 1.0566 1.0564 1.0575 1.0628 1.0569 1.0680 1.0735 1.0583 1.0350 1.0382 1.0355 1.0379 1.0357 1.0785 1.0356 1.0366 1.0362 1.0370 1.0376 1.0981 1.0590 1.1062 1.0890 1.0878 1.0796 1.0819 1.0973 1.0781 1.0976 1.0907 1.0993 1.0892 1.1007 1.1003 1.0817 1.0983 1.0828 1.0962 1.1007 1.1009 1.1010 1.0987 1.1002 1.0998 1.0995 1.0990 1.1033 1.0998 1.0991 1.0990 1.0991 1.0986 1.1034 1.1000 1.0878 1.1027 1.1024 1.0879 1.0956 1.0938
irintensity: 5265.1206 0.0792 0.2053 1.3393 0.4909 0.2330 0.2515 0.5287 1.7182 0.4306 1.2799 1.3163 0.2066 0.6059 0.0630 0.5791 0.9455 0.4258 5.5849 0.3804 0.4669 0.3869 0.9918 0.4018 0.3486 0.2059 0.1142 0.1287 1.4970 0.0859 0.4416 0.4265 3.7001 0.8092 0.9305 10.4172 1.8616 4.6995 9.7683 4.2182 2.7677 2.8635 3.0610 0.3630 6.4543 7.7017 5.1641 2.2951 2.3933 1.9583 2.1980 4.2977 0.4118 0.3590 1.0271 0.4625 1.8239 6.3559 1.0704 6.8726 0.9293 5.4902 4.5775 6.0113 14.2980 0.1776 9.3189 2.3258 5.9978 4.8130 0.6220 16.4839 15.2254 4.3561 0.3180 1.1528 3.2190 4.7112 5.3880 23.0541 22.4617 35.2080 86.7860 9.8095 4.2063 3.2830 6.8439 64.2777 1.1584 3.8627 5.8669 3.3025 1.0225 5.2941 1.7229 6.8556 0.1321 2.9321 7.6619 3.5913 5.5329 26.9653 9.8409 13.3053 9.2141 35.6623 18.3481 32.5726 44.3335 11.0708 6.5251 11.7788 29.4495 11.3215 12.8550 29.5690 64.5818 46.8280 109.7611 89.1923 53.2558 41.4756 40.9929 102.5262 140.3792 109.2836 143.8707 3.5432 117.6304 193.6195 13.0175 32.9314 25.7481 1.0360 22.2323 59.6259 7.0651 9.9414 19.0478 11.2860 3.4944 20.1937 71.4440 7.1284 16.6415 5.0499 2.2356 2.6212 55.5790 18.9705 3.4758 19.6796 0.7447 19.8119 3.5404 20.4527 5.7882 16.5685 140.8853 77.7275 2.8086 28.2987 4.1679 40.9318 46.6095 93.3272 10.0136 9.3540 17.6732 47.1895 22.5563 109.4550 37.8276 34.8627 23.2161 1.5703 11.5980 21.2366 95.6725 18.2916 82.8064 22.1553 13.3081 1.4113 21.5339 6.3567 1.7511 1.2733 0.1067 1.9172 2.5434 0.1333 1.8014 0.7097 1.2244 1.1202 1.8129 1.0058 12.3047 28.4116 4.5899 4.0852 3.6714 2.0083 0.1978 3.1736 1.1949 1.0718 9.3263 2.7754 5.1739 7.2593 0.3709 4.0802 4.7743 11.8809 12.2110 5.5926 12.9250 30.0905 15.4066 1.1249 17.7595 31.0754 50.3868 2.7270 15.6724 23.7937 9.4159 49.1849 17.7517 38.4927 30.0514 3.6124 32.9953 22.1418 131.6330 11.5120 93.5899 163.6201 150.9703 47.4330 60.9159 18.4393 21.0141 23.3991 7.5742 48.4217 6.6024 8.9480 9.5499 7.1052 19.2832 43.3641 7.5283 41.6384 4.4062 4.1696 23.3660 12.8421 22.5590 21.3057 6.1959 23.5697 72.6882 29.7654 13.8304 25.5378 3.1515 13.6808 9.5681 16.4267 19.3494 11.1759 4.3132 43.3350 20.1316 36.4524 12.3792 19.1418 20.9222 10.9031 24.4848 9.7525 3.4919 24.3439 11.3524 14.2808 10.4933 9.6058 4.9168 6.9902 27.1141 12.1719
temp: 298.150 k
press: 1.00000 atm
elementType: 14 14 14 11 8 7 7 6 6 6 6 1 1 7 6 1 6 6 1 1 1 6 1 1 1 5 6 1 6 1 1 1 6 1 6 1 6 1 1 1 6 1 1 1 6 1 1 1 6 1 1 1 6 1 1 1 6 1 1 1 6 1 1 1 6 1 1 6 1 1 1 6 1 1 6 1 1 1 6 1 1 6 1 1 1 6 1 1 1 6 1 1 1 6 1 1 1 1 1 1
symmnumber: 1
zpe: 2300552.2 jmol-1
zpe.correction: 0.876234 hartree
zpe.thermalcorrener: 0.929904 hartree
zpe.thermalcorrenthalpy: 0.930849 hartree
zpe.thermalcorrgfe: 0.788028 hartree
zpe.sumelectzpe: -2398.887504 hartree
zpe.sumelectthermal: -2398.833834 hartree
zpe.sumelectthermalent: -2398.832890 hartree
zpe.sumelectthermalfe: -2398.975710 hartree
dipole: -7.7228 -5.6612 0.3978
dipole: 9.5838
quadrupole: -243.4741 -262.6035 -248.4361
quadrupole: 7.7789 -7.8021 4.4840
quadrupole: 8.0305 -11.0989 3.0684 7.7789 -7.8021 4.4840
hfenergy: -2399.7637382 hartree
pointgroup: C01 [X(C28H63B1N3Na1O1Si3)]
dipole: -3.0294787 -2.2380265 0.174745 debye
polarizability: 422.2567445|-7.5304682|427.0852383|4.4553894|-3.3506397|407.5314286 unknown
InChI: InChI=1S/C15H29BOSi2.C9H23N3.C4H11Si.Na/c1-17-15-11-9-8-10-14(15)16(12-18(2,3)4)13-19(5,6)7;1-10(2)6-8-12(5)9-7-11(3)4;1-5(2,3)4;/h8-11H,12-13H2,1-7H3;6-9H2,1-5H3;1H2,2-4H3;
charge 0 multiplicity 1
100 atoms
Si 4.75009953 0.26094488 0.45555754
Si 0.61139822 1.30879415 2.49698573
Si -0.69045431 3.24901442 -1.46679646
Na -2.01963157 0.03219963 0.51617068
O  1.96770658 -0.50381974 -2.73684644
N  -4.36403307 0.64555492 -0.18155627
N  -2.22507843 -2.04761055 2.04637369
C  -0.76812418 1.42179735 -1.23378756
C  1.86272993 -1.51206176 -0.62078592
C  0.71050456 0.21051948 1.01040104
C  3.09367789 0.89091311 -0.18016833
H  2.92497814 1.88575039 0.24471177
H  3.21918929 1.00528415 -1.26455873
N  -2.69828779 -1.79542307 -0.94098907
C  1.74507212 -2.6829594 0.13307211
H  1.72033263 -2.59443733 1.2177657
C  1.88776528 -1.66209796 -2.02039895
C  4.61303516 -0.21314229 2.27829744
H  4.34006288 0.65858951 2.88341242
H  5.55765217 -0.60790245 2.66695961
H  3.84003251 -0.97529713 2.42703123
C  5.31646561 -1.24083481 -0.53576783
H  4.64276654 -2.09102214 -0.3927436
H  6.32510406 -1.54961077 -0.24000169
H  5.33459398 -1.01291893 -1.60704264
B  1.90507952 -0.09689944 0.11650302
C  1.79603523 -2.91753269 -2.62365709
H  1.80689863 -3.0204927 -3.70246126
C  6.04276967 1.62721223 0.28705366
H  5.75120603 2.51492249 0.85864259
H  6.15729944 1.93016853 -0.75909704
H  7.02263491 1.29996568 0.6513632
C  1.66633514 -3.9512153 -0.44672035
H  1.58967271 -4.83751538 0.17561471
C  1.68872474 -4.06001883 -1.83030233
H  1.62350807 -5.03357804 -2.30684675
C  1.10413857 3.80866583 -1.68954666
H  1.74021125 3.45675678 -0.87187173
H  1.18922767 4.89959583 -1.74250201
H  1.51770511 3.39355467 -2.61572695
C  1.52195729 2.94863872 2.30272287
H  2.6051781 2.79694476 2.36041057
H  1.24180698 3.64604923 3.09997673
H  1.30319492 3.42608063 1.34359674
C  -1.23384457 1.68463915 2.81010801
H  -1.6819872 2.19127916 1.94625686
H  -1.3699853 2.34321558 3.67441432
H  -1.79937726 0.76530588 3.01959322
C  -1.64706301 3.89434481 -2.98316728
H  -1.27617812 3.42617844 -3.90191331
H  -1.54963587 4.98062442 -3.0966997
H  -2.71753975 3.66697691 -2.90882769
C  1.25909365 0.50443268 4.0839246
H  2.33319784 0.31056358 4.0065743
H  0.77036508 -0.4523486 4.29317351
H  1.09713294 1.15754747 4.94931742
C  1.80493739 -0.55564112 -4.13405085
H  2.62222524 -1.1044742 -4.61910772
H  1.81499906 0.47969072 -4.47534994
H  0.84669288 -1.01648824 -4.40741783
C  -1.40504132 4.22202425 0.00591408
H  -0.80265785 4.08323938 0.90920771
H  -2.42951567 3.9127974 0.24970593
H  -1.43484436 5.29578411 -0.21196094
C  -2.98048648 -2.99684991 -0.15736699
H  -4.02866163 -2.98775484 0.15372994
H  -2.85641868 -3.90513179 -0.77230992
C  -3.54612038 -2.03379035 2.66327318
H  -3.59805621 -1.21882808 3.39135937
H  -3.77503137 -2.97986097 3.18595938
H  -4.32282839 -1.86195084 1.91602087
C  -2.08149499 -3.13242179 1.06936152
H  -2.28796848 -4.11121895 1.5421955
H  -1.03375566 -3.14823114 0.75015111
C  -1.21517527 -2.20007992 3.09085021
H  -0.21496601 -2.17359939 2.65366107
H  -1.33401686 -3.14881696 3.64314655
H  -1.29319287 -1.37493114 3.80333029
C  -3.86386814 -1.30327077 -1.67328845
H  -3.49961346 -0.60997251 -2.43749386
H  -4.3802268 -2.11791829 -2.21256496
C  -5.14572129 1.03784972 0.9869733
H  -5.11646904 0.24976389 1.74419499
H  -6.20191263 1.24444096 0.740141
H  -4.71433406 1.94301132 1.42414684
C  -1.55819139 -2.01268406 -1.83129676
H  -1.26223618 -1.06678849 -2.29031425
H  -1.7839834 -2.75162712 -2.6196112
H  -0.70090541 -2.37346955 -1.26055636
C  -4.35584835 1.74176671 -1.14890821
H  -3.87927599 2.61977991 -0.70829773
H  -5.37886506 2.01258116 -1.46412374
H  -3.77616767 1.47583819 -2.03366031
C  -4.88131848 -0.58576649 -0.78374786
H  -5.19197699 -1.25361914 0.02650429
H  -5.79023925 -0.38361101 -1.37868409
H  0.1235698 -0.70367848 1.1899261
H  -1.74470644 1.04923346 -1.58748687
H  0.02726741 0.83488907 0.05999545
H  -0.01817141 0.95334816 -1.89083848
