program: Gaussian 09
title: Fromconverged complex with TMPH.
version: ES64L-G09RevE.01
frameworkgroup: C1[X(C16H30N3NaO)]
method: RwB97XD
basis: Gen
operation: Freq
keyword: #PGeom=AllCheck
keyword: Guess=TCheck
keyword: SCRF=Check
keyword: GenChk
keyword: RwB97XD/ChkBas
keyword: Freq
title: From converged complex with TMPH.
converged: YES YES YES YES
title: Mulliken charges:
elementType: N N N C H H H C C H H C H H C H H H C H H C H H C H H H Na H H H C H H H C C C C C C H H H H O C H H H
charge: -0.677692 -0.658024 -0.618687 -0.212176 0.135877 0.162364 0.158123 -0.057833 -0.063710 0.133243 0.124395 -0.078174 0.136257 0.135930 -0.176375 0.144488 0.133541 0.114245 -0.044483 0.132844 0.116521 -0.216102 0.146458 0.179528 -0.198540 0.129534 0.137759 0.167528 0.410697 0.131011 0.143047 0.134446 -0.197511 0.160387 0.127828 0.178655 -0.093720 -0.221634 -0.109306 -0.149226 -0.169374 0.250030 0.071110 0.079674 0.088327 0.075290 -0.523408 -0.107664 0.105763 0.106328 0.122412
chargesum: -0.00000
title: Mulliken charges with hydrogens summed into heavy atoms:
elementType: N N N C C C C C C C C Na C C C C C C C O C
charge: -0.677692 -0.658024 -0.618687 0.244187 0.216225 0.193927 0.194013 0.215900 0.204882 0.244330 0.236281 0.410697 0.269359 -0.093720 -0.150524 -0.029632 -0.060899 -0.094085 0.250030 -0.523408 0.226839
polarizability: 2.39811065e+02 -6.63010498e+00 1.88817035e+02 3.78601082e+00 1.74108798e+01 1.99278786e+02
1716.lowfreq: -10.9859 -4.1725 -0.0014 -0.0012 -0.0012 9.7362 24.0978 30.7753 48.7886
frequency: 14.8637 30.3051 48.7430 57.1339 67.9031 70.1567 73.3971 89.9642 92.4974 103.3524 115.4731 134.3708 156.2367 189.6103 201.5013 221.6248 229.3988 246.3211 247.3446 254.9436 262.2417 289.9599 296.7302 302.9293 314.8773 326.3730 330.2755 367.3220 383.5799 399.3625 417.0563 424.1741 428.9138 447.9861 457.8220 467.4544 473.3099 539.1098 564.9277 578.4075 602.7905 636.5247 718.8733 772.4954 780.4765 787.3229 806.9842 820.7257 873.6180 920.0720 937.1519 968.8809 978.5343 988.6133 1008.5009 1015.0389 1063.9476 1069.4434 1074.4410 1075.2047 1082.3086 1085.4915 1107.2653 1109.1888 1119.1537 1130.2029 1132.1206 1151.1038 1160.8609 1168.6491 1191.2270 1191.3915 1191.9679 1197.6279 1203.5925 1222.8867 1238.3070 1280.9119 1287.5454 1308.5133 1308.7324 1323.9429 1332.1265 1339.5339 1344.2169 1352.7565 1359.2006 1404.4284 1412.2171 1432.6779 1441.8742 1458.1700 1460.7433 1465.2009 1475.1485 1483.3122 1484.7339 1486.5550 1493.3901 1495.6274 1496.5537 1499.8734 1501.3011 1504.9572 1511.8062 1512.1222 1513.3890 1515.7687 1518.5875 1522.1696 1523.2792 1525.5759 1526.1443 1530.3805 1533.4016 1635.9288 1648.3401 2959.4711 2962.6161 2969.1256 2975.6485 2976.3169 2979.7242 2981.6678 2982.9405 2988.9855 3011.7449 3078.0223 3097.0452 3107.0532 3107.9404 3113.2803 3115.8900 3118.7036 3125.0382 3132.0815 3132.5635 3136.2923 3137.1700 3157.3280 3159.0879 3160.9461 3164.3528 3179.4706 3187.7435 3206.6581 3222.4525
redmass: 4.5226 3.6133 3.8735 2.8823 3.7999 2.7998 4.1908 3.3537 3.6775 3.3631 4.4125 2.8336 2.7066 6.7438 2.1431 3.3915 1.7818 2.3183 1.2959 1.4907 1.1877 2.7496 1.7816 1.4317 2.9562 1.2558 2.3841 2.3859 2.3941 2.0904 1.9630 2.0906 3.4304 1.9758 2.0556 2.1731 5.4542 3.4409 5.1578 2.5062 2.8899 6.7950 2.2608 1.8748 2.2940 5.3765 2.5473 3.1040 1.2954 1.9633 1.3462 2.2953 2.2210 1.2831 7.2404 2.2293 3.4897 2.0094 2.1550 1.5853 1.5847 1.4930 1.8370 2.3632 1.7936 1.2876 1.3271 1.6628 1.3679 1.8034 1.7254 1.2870 1.4303 1.7940 1.6022 1.7398 1.7379 2.4970 2.0738 1.4951 1.6181 2.2316 1.8918 1.3896 4.8773 1.7025 1.5763 1.4548 1.3824 1.5234 1.4553 1.1756 1.1762 1.8856 1.1540 1.7538 1.2843 1.1521 1.1410 1.0608 1.0918 1.1108 1.0912 1.0636 1.0953 1.0808 1.0764 1.0616 1.0806 1.0873 1.0620 1.0617 1.0673 1.0789 1.0532 5.3614 5.4445 1.0718 1.0713 1.0579 1.0563 1.0583 1.0578 1.0578 1.0736 1.0712 1.0361 1.1024 1.0884 1.0804 1.0839 1.0768 1.0808 1.0824 1.0854 1.0819 1.0838 1.0912 1.0971 1.1031 1.1029 1.1022 1.1034 1.1018 1.0859 1.0931 1.0951
irintensity: 0.0543 0.9109 3.2121 0.3113 1.2290 0.2779 4.8950 1.6773 0.8985 5.0343 4.5860 2.2137 3.3424 7.5427 1.1425 6.4399 3.8728 3.8207 0.5584 1.4228 0.7953 0.9253 0.9063 1.8897 19.1196 0.2836 4.0580 7.0033 6.7411 1.3003 11.1559 9.6426 8.6493 2.6797 0.3184 1.1315 3.8717 0.0823 5.7868 6.4598 6.7044 2.0194 5.0363 37.4324 9.7206 40.2237 20.1718 21.3751 0.5904 11.0979 1.0834 32.9897 6.1951 0.1592 0.8895 22.1670 12.1900 12.5576 3.1920 6.2081 23.1068 12.1067 24.5520 1.1228 3.9779 1.4040 2.7256 8.6023 3.4918 28.2051 94.2531 3.6753 17.6087 112.3096 25.3062 14.3771 81.4847 2.8016 1.3283 2.7224 0.7755 3.8291 5.1953 5.1592 0.5745 26.8398 27.3005 21.9645 18.0432 8.6047 1.7295 0.8413 3.7060 50.2615 2.7408 2.6921 3.1346 3.1226 8.8526 11.8254 3.3181 2.0613 1.4466 14.7371 1.6884 6.1733 36.2552 2.1536 17.6048 12.5078 35.9738 23.4835 14.0569 14.9970 13.9264 31.3158 5.0537 24.7305 25.3725 42.9128 51.1444 129.4593 44.0611 84.3354 113.5527 213.1718 62.7468 47.1525 8.3046 33.3173 11.6453 20.4173 16.6986 22.2898 25.8259 32.5004 27.7002 17.6648 70.1106 18.9653 12.4028 27.4381 18.9388 11.8078 9.3658 68.6441 41.9126
temp: 298.150 k
press: 1.00000 atm
elementType: 7 7 7 6 1 1 1 6 6 1 1 6 1 1 6 1 1 1 6 1 1 6 1 1 6 1 1 1 11 1 1 1 6 1 1 1 6 6 6 6 6 6 1 1 1 1 8 6 1 1 1
symmnumber: 1
zpe: 1191357.6 jmol-1
zpe.correction: 0.453764 hartree
zpe.thermalcorrener: 0.478485 hartree
zpe.thermalcorrenthalpy: 0.479429 hartree
zpe.thermalcorrgfe: 0.398737 hartree
zpe.sumelectzpe: -1028.814198 hartree
zpe.sumelectthermal: -1028.789478 hartree
zpe.sumelectthermalent: -1028.788533 hartree
zpe.sumelectthermalfe: -1028.869225 hartree
dipole: -8.6023 0.4187 3.3145
dipole: 9.2282
quadrupole: -135.5099 -123.1200 -127.8239
quadrupole: 1.2964 11.4638 2.0698
quadrupole: -6.6920 5.6979 0.9940 1.2964 11.4638 2.0698
hfenergy: -1029.2679623 hartree
pointgroup: C01 [X(C16H30N3Na1O1)]
dipole: -1.4654997 -3.3139032 0.2282531 debye
polarizability: 211.2975088|1.1667908|238.5096051|6.5890775|11.2597418|178.0997729 unknown
InChI: InChI=1S/C9H23N3.C7H7O.Na/c1-10(2)6-8-12(5)9-7-11(3)4;1-8-7-5-3-2-4-6-7;/h6-9H2,1-5H3;2-5H,1H3;
charge 0 multiplicity 1
51 atoms
N  -2.14527189 -0.61646558 1.91247864
N  -2.28101479 -1.71525025 -1.91641084
N  -0.51680943 -2.59076428 0.31795144
C  0.92728876 -2.56826845 0.51686097
H  1.33367943 -3.55764017 0.79216947
H  1.18697637 -1.85856445 1.30616099
H  1.42144889 -2.22681653 -0.39681236
C  -1.37960182 -1.71194687 2.49450964
C  -1.22754894 -2.91035831 1.55656573
H  -0.71860887 -3.72394013 2.10395506
H  -2.21869575 -3.29407194 1.30057353
C  -0.89978561 -3.46607136 -0.78795295
H  -0.94664389 -4.52534478 -0.47794852
H  -0.11506106 -3.40934274 -1.54820397
C  -3.56644708 -0.9056575 1.81917088
H  -4.06910636 -0.0703403 1.32442368
H  -4.03357476 -1.06039501 2.8091734
H  -3.74204295 -1.80164056 1.21648162
C  -2.2420488 -3.08424583 -1.4159826
H  -2.47463425 -3.81591884 -2.21287471
H  -3.03563573 -3.18286069 -0.66686393
C  -1.45442982 -1.52174221 -3.10185781
H  -0.40713676 -1.74300862 -2.88026654
H  -1.50492066 -0.47427913 -3.40986427
C  -3.64516558 -1.26874509 -2.16040017
H  -4.22928903 -1.34396882 -1.23796323
H  -4.15244701 -1.8582891 -2.94497476
H  -3.63020169 -0.21900862 -2.46486638
Na -1.19472719 -0.2347738 -0.30392907
H  -1.82595996 -2.0645371 3.44374327
H  -0.38792581 -1.3217523 2.74553558
H  -1.77546739 -2.1573347 -3.94630451
C  -1.91823754 0.63710203 2.62544024
H  -2.46981185 1.43988457 2.13102837
H  -2.23392249 0.57991827 3.682286
H  -0.86078443 0.9071656 2.57210959
C  -0.2767277 1.95574062 -0.28861247
C  0.78089651 2.8301453 -0.00415919
C  0.61814607 4.20024428 0.24661169
C  -0.65378536 4.7540969 0.22190799
C  -1.75659601 3.9413326 -0.05588557
C  -1.52637963 2.58896436 -0.30304419
H  1.79900554 2.43735983 0.0311395
H  1.47984191 4.82801422 0.46344705
H  -0.80257258 5.81333402 0.41429016
H  -2.74801174 4.3845865 -0.07489024
O  -2.60844299 1.71174741 -0.57612648
C  -3.91260242 2.2242422 -0.53006063
H  -4.58742006 1.39111773 -0.74657452
H  -4.15761561 2.63320206 0.46145533
H  -4.07218818 3.01096355 -1.27943989
