program: Gaussian 16
title: displacement calc 0.5
version: ES64L-G16RevC.01
frameworkgroup: C1[X(C31H59BN3NaO2Si2)]
method: UwB97XD
basis: Gen
operation: Freq
keyword: #P
keyword: Geom=AllCheck
keyword: Guess=TCheck
keyword: SCRF=Check
keyword: GenChk
keyword: UwB97XD/ChkBas
keyword: Freq
converged: YES YES NO YES
polarizability: 4.34699083e+02 2.36239282e+01 4.13063901e+02 1.71350836e+01 -1.59394036e+00 4.01996618e+02
1716.lowfreq: -4.3009 0.0007 0.0012 0.0014 2.4387 3.9970 22.1767 23.8627 28.2921
redmass: 3.7076 3.9617 4.7069 4.2507 3.5195 4.1501 3.5990 3.6660 4.3016 4.0073 4.1587 3.9784 4.1368 4.1048 4.3384 4.1629 3.9600 3.4218 3.5754 3.1963 3.2934 3.7660 3.2224 3.3246 2.9261 1.2777 2.6287 3.3072 2.1281 3.4015 3.2209 2.4791 1.6414 3.1270 1.1709 1.4649 1.8072 6.1304 1.4556 1.7313 2.2279 1.8017 1.6525 1.5187 1.7595 2.3721 1.5325 1.9335 1.9497 1.9049 5.3932 2.1266 1.4475 2.0322 1.4997 1.3977 2.1146 1.4964 1.8968 1.9639 1.8890 2.7710 1.7578 1.9019 2.9359 2.2318 1.9925 1.9032 4.2972 2.1918 2.7868 3.1706 2.0720 2.1268 5.3401 2.0198 3.7387 4.7178 3.3902 5.0480 3.4508 3.1659 4.1931 2.9628 2.7285 3.2058 6.8196 1.6000 3.2142 1.1734 1.2570 1.5837 2.1946 2.1324 2.1368 1.9640 2.7012 2.3476 2.2340 1.8139 1.6099 1.8162 1.5458 5.2940 2.3482 2.0753 1.6137 2.3521 3.3255 1.7061 3.3495 1.4980 1.3840 1.4967 1.6285 1.7574 1.7170 1.4583 1.7676 1.9943 1.7942 1.3709 2.3373 1.3519 1.3064 2.0913 1.3359 2.0150 1.3070 6.9080 1.5216 3.4393 2.9709 1.9996 1.4840 1.4612 1.9410 2.8399 1.7715 2.3945 1.5079 1.7594 1.7022 1.2765 1.6998 1.4815 1.7424 1.4530 1.5754 1.2632 1.2822 1.7416 1.2252 1.1391 1.4625 2.1184 1.7042 1.7823 2.3338 2.0680 2.2020 2.6003 3.0240 2.0960 2.8183 1.5286 1.5074 1.2709 1.2750 1.3558 1.6436 1.2614 1.2465 2.2118 1.2439 1.5988 1.6061 1.3830 5.4724 4.8001 1.7346 1.4662 1.3496 1.2174 1.3955 1.2420 1.1767 1.2677 1.1729 1.7207 1.0585 1.0560 1.0607 1.0718 1.2622 1.0563 1.2072 1.0603 1.0934 1.4975 1.1306 1.0742 1.1138 1.1275 1.1687 1.1697 1.1250 1.1155 1.1039 1.0636 1.0966 1.0836 1.4365 1.0999 1.0904 1.0730 1.0599 1.0657 1.0835 1.0596 1.0749 1.0799 1.0853 1.0733 1.0934 1.0720 2.3450 1.0761 5.1854 5.4543 6.0861 6.3584 1.0713 1.0717 1.0699 1.0609 1.0717 1.0573 1.0606 1.0595 1.0605 1.0627 1.0332 1.0372 1.0358 1.0356 1.0354 1.0366 1.0361 1.0364 1.0809 1.0813 1.0876 1.0868 1.0945 1.0809 1.0896 1.0860 1.0881 1.0792 1.0796 1.0836 1.0941 1.0960 1.0788 1.1001 1.1003 1.1005 1.1004 1.1006 1.1009 1.1006 1.0997 1.1010 1.1011 1.1003 1.0995 1.0987 1.1014 1.1023 1.0995 1.1021 1.1027 1.0874 1.0890 1.0976 1.0907 1.0870 1.0959 1.0928 1.0986
irintensity: 0.2989 0.2356 0.9316 0.4681 0.4978 1.3487 0.2679 1.0830 1.5317 0.9833 0.4850 0.1593 0.2666 0.8559 0.7490 0.2740 0.7561 0.5711 1.0827 0.9150 0.2260 8.1953 4.1977 1.9776 0.4840 0.3890 1.9281 0.1748 1.1419 14.5780 15.9842 2.4086 0.0056 6.5508 0.0670 0.3394 3.3354 20.7162 2.0329 2.6019 0.8056 0.6406 0.9436 1.3491 1.1030 2.5754 2.0296 0.3086 6.5408 1.1981 11.5101 3.8596 2.3576 5.6972 1.5168 3.5375 4.3120 0.0594 0.8520 1.3671 3.0038 3.1594 0.3929 2.0552 4.0456 6.2698 7.8661 4.5337 1.1168 1.7549 11.7896 3.7422 0.1063 0.2137 3.6842 3.2187 5.8075 2.0888 0.9414 4.2286 2.2909 1.7257 3.1226 2.4797 2.6274 2.2519 2.0046 2.1943 4.5235 0.0948 0.4478 5.0631 5.6442 7.2078 2.4397 8.9877 6.9597 6.6499 9.3375 33.9521 8.0740 61.1047 11.1703 27.1435 14.3454 11.3600 10.7577 22.0331 20.6854 4.4986 29.0669 45.4589 9.9743 45.4537 72.7838 128.3420 98.0622 1.1547 253.6351 20.9342 107.9348 7.9774 13.6896 1.9795 1.5192 23.8221 5.4401 1.0790 1.0068 3.1024 45.0006 13.1781 11.9305 21.9553 10.6062 1.4505 4.0912 20.6787 8.8600 2.9049 44.0346 11.2479 8.5062 3.7721 59.8309 28.8200 12.4307 7.1307 27.1617 0.1992 0.4064 39.8431 7.9598 3.7264 9.9724 65.7664 38.0511 39.0122 145.9790 7.7464 158.0015 145.9294 3.9988 0.7316 112.6621 3.1230 6.4492 34.4415 60.5892 18.9442 72.5064 5.6449 29.2195 9.4518 42.0854 2.9480 6.0593 4.9916 4.9469 2.5865 43.1130 29.0074 13.5772 7.8903 2.0452 11.9547 15.4042 6.0540 0.1624 49.2617 0.9648 1.4817 4.7230 2.1697 0.5695 2.2891 10.7961 8.2048 5.8679 5.3099 7.8328 1.6580 2.7040 10.0113 2.5740 11.0557 3.5722 12.6673 20.7289 6.0182 4.0325 4.4323 13.2193 7.1312 0.1482 5.7443 9.9221 32.3647 32.6562 49.1353 11.7823 18.2647 23.1669 11.9735 9.2219 7.4430 46.0646 14.9110 33.8698 5.7777 17.0310 23.2816 13.9739 8.2241 18.0578 24.0975 97.3940 36.0517 191.2343 189.0577 211.6172 46.3749 58.8576 53.4218 10.2704 8.1739 10.6265 7.5893 5.1640 15.3220 21.6619 26.3590 2.8835 3.4251 29.9403 38.6100 11.6272 50.9201 47.0059 32.4113 15.5379 6.7932 48.4332 38.3767 9.6907 9.2649 8.4085 17.1745 27.0736 6.2013 21.0953 9.1610 11.5887 19.5611 5.8357 29.9465 1.2545 4.7494 5.2301 13.9219 6.4786 7.4320 3.8079 16.9993 7.0685 7.5400 37.9292 2.6806 32.7406 18.4049 20.2304
temp: 298.150 k
press: 1.00000 atm
elementType: 14 14 11 7 7 7 6 6 8 6 1 1 6 6 1 1 6 1 6 1 6 1 6 6 1 6 1 6 1 6 1 6 1 1 1 6 1 1 6 1 1 6 1 1 1 6 1 1 1 5 6 1 1 1 6 1 1 6 1 1 1 6 1 1 1 6 1 1 1 6 1 1 6 1 1 1 6 1 1 1 6 1 1 1 6 1 1 1 6 1 1 1 8 6 1 1 1 6 1
symmnumber: 1
zpe: 2273184.1 jmol-1
zpe.correction: 0.865810 hartree
zpe.thermalcorrener: 0.918050 hartree
zpe.thermalcorrenthalpy: 0.918995 hartree
zpe.thermalcorrgfe: 0.779864 hartree
zpe.sumelectzpe: -2296.457558 hartree
zpe.sumelectthermal: -2296.405318 hartree
zpe.sumelectthermalent: -2296.404374 hartree
zpe.sumelectthermalfe: -2296.543504 hartree
dipole: 5.3737 5.3316 2.6107
dipole: 8.0073
quadrupole: -243.1473 -268.0116 -254.1233
quadrupole: 4.7628 1.2503 -8.0260
quadrupole: 11.9468 -12.9175 0.9707 4.7628 1.2503 -8.0260
hfenergy: -2297.3233683 hartree
pointgroup: C01 [X(C31H59B1N3Na1O2Si2)]
dipole: 2.1390432 -2.0610535 -1.049348 debye
polarizability: 435.2069849|-23.2122185|412.4123097|-17.404067|-1.6682876|402.140307 unknown
InChI: InChI=1S/C15H29BOSi2.C9H23N3.C7H7O.Na/c1-17-15-11-9-8-10-14(15)16(12-18(2,3)4)13-19(5,6)7;1-10(2)6-8-12(5)9-7-11(3)4;1-8-7-5-3-2-4-6-7;/h8-11H,12-13H2,1-7H3;6-9H2,1-5H3;2-5H,1H3;
charge 0 multiplicity 1
99 atoms
Si -3.25658101 -0.72489076 -2.33052453
Si -3.69144808 0.50186865 2.04954685
Na 1.99211427 0.44210682 0.14386081
N  2.06422946 -1.23346984 2.37040159
N  3.82510771 1.54842819 -1.42741755
N  4.28730712 -0.56589124 0.54776409
C  0.60414874 2.32407015 0.78037586
C  -0.96640573 -2.05177222 -0.01561488
O  0.88741603 -1.15712659 -1.19316406
C  -1.96506106 -0.05203824 1.53488421
H  -1.39080076 0.89118804 1.55413007
H  -1.58146459 -0.67670593 2.35202147
C  0.21808257 -2.27240101 -0.72722363
C  -2.0255206 0.14071582 -1.19132399
H  -1.10984683 0.23162625 -1.78972597
H  -2.37141591 1.15726387 -0.97897964
C  -0.92286703 3.84754949 2.00934082
H  -1.24547811 4.27015201 2.9586863
C  -1.58206327 -3.17691809 0.5480535
H  -2.48746932 -3.03757653 1.1356913
C  -1.5463621 4.22868807 0.82960238
H  -2.36470048 4.9436877 0.83783195
C  -0.05192078 2.78178744 -0.37210977
C  -1.07685885 -4.46237868 0.36978825
H  -1.58822489 -5.31531453 0.80426337
C  -1.10741629 3.69586717 -0.3865188
H  -1.60080576 4.00696464 -1.302222
C  0.75178184 -3.54597024 -0.90615874
H  1.67712965 -3.67859972 -1.45845472
C  0.09152052 -4.64584054 -0.36372182
H  0.4999535 -5.64154967 -0.50553784
C  1.10020631 -2.27582522 2.69772721
H  0.0888965 -1.89599715 2.55562176
H  1.19978732 -2.62292866 3.74302366
H  1.22846279 -3.13154309 2.02784146
C  3.41532813 -1.73425238 2.58177948
H  3.46762889 -2.74454613 2.16294624
H  3.64380018 -1.8384814 3.66009431
C  4.50754764 -0.87224529 1.95871881
H  4.58488108 0.08045072 2.49439255
H  5.46964705 -1.39978567 2.10880927
C  1.79831576 -0.03537983 3.16035404
H  2.46107312 0.78241796 2.86316501
H  1.92184956 -0.21827696 4.24403309
H  0.78005734 0.30774235 2.96618255
C  -3.50860633 1.4451212 3.67035916
H  -4.47454733 1.8011519 4.04422756
H  -2.85779657 2.31263519 3.51836502
H  -3.05744348 0.8179913 4.44695656
B  -1.65683582 -0.62868623 0.11864375
C  4.09919849 -1.76795851 -0.25299397
H  3.19225614 -2.28863227 0.06215345
H  4.95746922 -2.46153408 -0.18450324
H  3.96212286 -1.49290347 -1.30060902
C  5.37759904 0.26227379 0.04229005
H  6.32514641 -0.30717925 -0.01310078
H  5.54399604 1.06619383 0.76651573
C  -4.06144946 0.58227979 -3.42662347
H  -4.59371368 1.32327172 -2.82052454
H  -4.77923673 0.1399104 -4.12542354
H  -3.3066833 1.11683561 -4.0140045
C  -2.35643191 -1.97673623 -3.42026386
H  -1.79285696 -2.69499256 -2.81494453
H  -1.6576778 -1.47504424 -4.09933761
H  -3.06564041 -2.5402264 -4.03593103
C  -4.602424 -1.65773671 -1.39378179
H  -4.1653792 -2.43251947 -0.75412293
H  -5.28139381 -2.15410753 -2.09552183
H  -5.20255884 -0.99564142 -0.76275737
C  5.10751538 0.8654238 -1.33397281
H  5.94925966 1.54399905 -1.57376683
H  5.12587788 0.07824555 -2.09585479
C  3.52965324 1.8918827 -2.81007329
H  3.52205288 0.98707235 -3.42741512
H  4.27062748 2.59152349 -3.23873167
H  2.54277613 2.35600428 -2.85439481
C  3.78678023 2.75289996 -0.60120013
H  2.80389269 3.21860389 -0.68905945
H  4.57297507 3.47414625 -0.8912757
H  3.91280503 2.50055617 0.45459169
C  1.27012455 -1.13860167 -2.5575994
H  1.517221 -0.09896334 -2.78051796
H  0.44374324 -1.46931615 -3.19388316
H  2.14779471 -1.77018841 -2.74357306
C  -4.47542754 1.65464624 0.7829921
H  -5.41081587 2.07122175 1.17217286
H  -4.69967543 1.15480354 -0.16367676
H  -3.79351124 2.48649506 0.57419015
C  -4.78156095 -1.01175857 2.35149078
H  -4.34827739 -1.64047827 3.13775605
H  -4.88890349 -1.62694292 1.45288065
H  -5.78584647 -0.72122462 2.67810057
O  0.42780487 2.22542595 -1.5707831
C  -0.17340245 2.62950605 -2.77392783
H  0.3222129 2.07398124 -3.57570032
H  -1.24604685 2.39359246 -2.79922994
H  -0.04513921 3.70566163 -2.95579736
C  0.12414027 2.91481191 1.95890059
H  0.5713985 2.63045853 2.91564747
