program: Gaussian 09
title: 000002334
version: EM64L-G09RevD.01
frameworkgroup: C1[X(C12H6O12)]
method: RPBEPBE
basis: SDD
operation: Freq
keyword: #pfreq=noraman
keyword: PBEPBE/SDD
title: #p freq=noraman PBEPBE/SDD
converged: YES YES NO NO
title: Mulliken charges:
elementType: O O O O O O O O O O O O C C C C C C C C C C C C H H H H H H
charge: -0.404007 -0.403869 -0.404046 -0.403939 -0.403844 -0.403828 -0.201511 -0.200883 -0.201444 -0.201335 -0.200766 -0.201099 0.122223 0.124215 0.121998 0.121421 0.124101 0.122399 0.088007 0.087312 0.087936 0.087995 0.087121 0.087655 0.394770 0.394538 0.394731 0.394801 0.394566 0.394780
chargesum: 0.00000
title: Mulliken charges with hydrogens summed into heavy atoms:
elementType: O O O O O O O O O O O O C C C C C C C C C C C C
charge: -0.009237 -0.009331 -0.009315 -0.009138 -0.009278 -0.009048 -0.201511 -0.200883 -0.201444 -0.201335 -0.200766 -0.201099 0.122223 0.124215 0.121998 0.121421 0.124101 0.122399 0.088007 0.087312 0.087936 0.087995 0.087121 0.087655
polarizability: 2.08755735e+02 2.41067671e-02 2.08561336e+02 3.34725247e-02 5.13967319e-03 1.09468722e+02
1716.lowfreq: -2.1737 -0.0008 -0.0008 -0.0006 3.2420 5.0160 19.2763 32.7549 34.2852
frequency: 19.1738 32.7452 34.2803 69.3806 70.9820 71.5931 94.1739 94.5369 94.9046 140.0099 154.9218 154.9648 156.4904 156.8536 164.3263 191.2008 192.0853 255.9158 256.0244 279.1943 290.5743 302.5669 304.2872 305.0718 360.0552 415.8804 416.4613 527.8719 542.3494 544.6591 553.5240 553.8277 578.4666 584.1073 585.8995 593.7595 594.4471 598.8020 632.7938 634.9071 661.9398 662.4034 686.8761 687.4529 692.9185 767.7840 768.1332 799.6482 799.7121 828.9022 887.4416 916.9599 917.5686 1015.3034 1041.1497 1047.4647 1048.4233 1079.8359 1080.6267 1179.7918 1205.9429 1270.2417 1270.6274 1302.0323 1302.8069 1341.5222 1352.5393 1374.3821 1420.9339 1421.4335 1570.4551 1570.9913 1650.2235 1650.4766 1654.2795 1661.6781 1661.8621 1665.9728 3519.0110 3519.2755 3519.3496 3519.9324 3520.1325 3520.5979
redmass: 10.3423 9.8302 9.8659 8.8067 9.3236 9.3273 8.7653 9.3773 9.3810 10.4829 11.0133 10.7334 6.9786 6.7657 7.6011 8.2209 8.1996 11.3755 11.3816 5.5348 9.9123 10.7166 9.5319 9.5186 11.7427 4.9965 4.9818 2.4267 1.6665 1.7026 5.2084 5.1502 1.4788 1.8438 2.0280 3.1143 2.7808 2.0314 3.9491 4.1437 2.3443 2.3570 5.5529 5.5850 3.4673 11.6170 11.6284 8.0455 8.0274 11.7885 11.1811 12.4376 12.4246 5.4185 3.9673 2.8165 2.8096 2.1639 2.1592 2.0357 2.0630 2.2224 2.2259 2.6298 2.6391 4.4468 11.5093 6.0520 9.9573 10.0085 11.9969 12.0003 10.2813 10.2876 10.1522 10.0610 10.0674 10.1540 1.0643 1.0643 1.0642 1.0642 1.0642 1.0642
irintensity: 4.6170 0.7996 0.7556 0.3131 5.3486 5.5558 2.5323 0.0434 0.0807 0.0007 0.3190 0.2835 0.0470 0.0182 0.0003 1.0877 1.1103 1.1947 1.1269 0.2869 0.0007 8.2727 1.7156 1.6270 0.0015 0.5113 0.5088 113.4696 78.7960 68.5124 155.0000 164.2668 0.4649 110.7247 90.4864 32.7741 44.5766 75.9060 104.9511 0.0224 1.1682 1.4173 35.1270 34.1851 0.0283 0.5078 0.5047 16.5491 17.2098 59.0153 0.0008 8.9343 9.1162 517.1010 0.4992 258.8265 254.5119 327.1843 322.3690 105.1993 0.0125 45.9140 45.5628 40.3461 41.0015 102.2386 0.0017 0.0056 86.3366 84.1320 0.7869 0.8281 35.0778 20.2104 692.6252 287.2730 283.7129 0.5879 29.8234 26.4882 23.0762 122.5068 121.6687 9.4945
temp: 298.150 k
press: 1.00000 atm
elementType: 8 8 8 8 8 8 8 8 8 8 8 8 6 6 6 6 6 6 6 6 6 6 6 6 1 1 1 1 1 1
symmnumber: 1
zpe: 464396.9 jmol-1
zpe.correction: 0.176879 hartree
zpe.thermalcorrener: 0.199689 hartree
zpe.thermalcorrenthalpy: 0.200633 hartree
zpe.thermalcorrgfe: 0.123177 hartree
zpe.sumelectzpe: -1361.868685 hartree
zpe.sumelectthermal: -1361.845875 hartree
zpe.sumelectthermalent: -1361.844931 hartree
zpe.sumelectthermalfe: -1361.922387 hartree
dipole: -0.0109 0.0082 0.0042
dipole: 0.0143
quadrupole: -115.0887 -114.8395 -147.2979
quadrupole: -0.0757 -0.1015 -0.0825
quadrupole: 10.6533 10.9025 -21.5558 -0.0757 -0.1015 -0.0825
hfenergy: -1362.0455642 hartree
pointgroup: C01 [X(C12H6O12)]
dipole: 0.0050781 0.0017284 -0.001637 debye
polarizability: 208.7219625|-0.0775096|208.5951186|-0.0062622|-0.0095258|109.4687114 unknown
InChI: InChI=1S/C12H6O12/c13-7(14)1-2(8(15)16)4(10(19)20)6(12(23)24)5(11(21)22)3(1)9(17)18/h13,15,17,19,21,23H
charge 0 multiplicity 1
30 atoms
O  2.88416 2.068733 0.982086
O  2.36269 -2.644114 -0.989016
O  1.1210 3.367266 -0.981018
O  0.351216 -3.536749 0.970283
O  -3.229264 1.47132 0.985148
O  -3.480143 -0.718311 -0.971692
O  3.570129 0.830159 -0.86597
O  3.291802 -1.607607 0.877559
O  -0.267318 3.65672 0.865279
O  -1.067308 -3.502357 -0.875488
O  -2.512088 2.663874 -0.88181
O  -3.030488 -2.052299 0.882794
C  1.297917 0.569894 0.002586
C  1.140692 -0.841139 -0.001522
C  0.158366 1.408889 -0.001754
C  -0.155641 -1.408797 0.001327
C  -1.142371 0.839429 0.002143
C  -1.299315 -0.566713 0.000031
C  2.691494 1.144823 -0.039809
C  2.372272 -1.710731 0.043054
C  0.294308 2.910079 0.040266
C  -0.35471 -2.902982 -0.047149
C  -2.338496 1.756983 -0.045119
C  -2.667597 -1.199475 0.049729
H  3.811065 2.429528 0.939101
H  3.18517 -3.203312 -0.944174
H  1.192324 4.359314 -0.937167
H  0.200625 -4.519695 0.922516
H  -4.007623 2.090283 0.937898
H  -4.37427 -1.153515 -0.924011
