program: Gaussian 09
title: 000005476
version: EM64L-G09RevD.01
frameworkgroup: C1[X(C17H22NOS2)]
method: RPBEPBE
basis: SDD
operation: Freq
keyword: #p
keyword: freq=noraman
keyword: PBEPBE/SDD
title: #p freq=noraman PBEPBE/SDD
converged: YES YES NO NO
title: Mulliken charges:
elementType: S S O N C C C C C C C C C C C C C C C C C H H H H H H H H H H H H H H H H H H H H H H
charge: 0.249248 0.203496 -0.272757 -0.097808 -0.438211 -0.568402 -0.017342 -0.645028 0.338738 -0.548809 -0.554120 0.416523 -0.352997 -0.316578 -0.508192 -0.275382 -0.258068 -0.129565 -0.127437 -0.495308 -0.484300 0.285639 0.285110 0.274486 0.295488 0.240809 0.291410 0.240844 0.262246 0.266737 0.267734 0.283831 0.259330 0.258709 0.226188 0.214311 0.256009 0.285534 0.285349 0.266689 0.266552 0.285377 0.283917
chargesum: 1.00000
title: Mulliken charges with hydrogens summed into heavy atoms:
elementType: S S O N C C C C C C C C C C C C C C C C C
charge: 0.249248 0.203496 -0.272757 -0.097808 0.132539 0.001572 0.223467 -0.112774 0.338738 0.247908 0.247749 0.416523 -0.352997 -0.316578 0.188316 0.010152 0.027281 0.137124 0.139116 -0.209931 -0.200382
chargesum: 0.99942
polarizability: 2.84169852e+02 -6.64976180e-01 2.64776078e+02 3.22205647e+00 1.71256276e+01 1.54512244e+02
1716.lowfreq: -5.0614 -2.7408 -0.0212 0.0021 6.3305 7.6461 25.8609 32.9070 49.6422
frequency: 25.6232 32.7190 49.5965 62.7178 70.8833 80.5441 87.0749 116.9307 141.5667 155.8423 172.1671 184.8113 213.3629 226.9517 242.3284 255.6142 258.7143 269.1628 288.4052 318.3449 323.4954 340.5841 411.1409 439.6431 446.4626 457.3211 470.7303 487.8941 496.9234 517.8128 553.4867 570.4628 582.8313 600.2684 644.3231 665.4532 687.7922 691.3790 715.7170 720.8727 747.1648 756.1363 814.5310 822.1333 834.3168 856.1229 858.8901 875.6097 885.4992 891.0246 915.3991 928.9840 929.8007 933.5658 968.7682 978.7714 1027.7985 1054.2420 1055.3418 1066.9147 1087.6264 1088.5557 1092.5480 1110.4013 1112.9988 1119.0080 1133.2282 1144.8296 1176.2437 1191.6446 1203.0557 1212.7161 1232.3306 1238.5350 1261.4793 1285.0938 1295.1458 1305.4124 1323.7860 1326.6418 1334.7884 1339.0929 1349.4833 1375.1656 1418.1897 1440.0064 1441.1946 1447.4572 1450.7733 1458.8948 1460.0119 1461.4804 1466.3278 1467.7301 1476.1278 1476.7373 1479.4342 1492.4481 1522.5112 1534.4216 1591.8836 2941.0525 2960.9783 2962.1723 3000.1957 3020.6810 3026.6440 3030.7664 3051.6243 3098.8481 3102.5059 3108.8557 3129.3125 3137.2927 3140.0011 3142.3032 3151.5941 3176.0735 3179.1459 3194.9301 3196.3236 3239.2740 3239.8012
redmass: 6.4815 4.4043 4.7985 5.0336 4.3520 2.7982 5.3427 2.8438 3.7956 3.0812 1.6309 1.0542 4.6248 1.7252 4.3165 1.7000 5.2769 3.4903 2.6277 3.4305 2.6615 3.6528 4.5601 2.1498 3.5973 3.5956 3.0764 3.4084 3.3353 2.9771 3.3580 3.3340 6.0281 8.0561 8.0435 5.3159 6.8760 6.5528 1.1870 1.1766 5.3045 5.0977 4.6644 3.5387 4.4813 1.3744 1.3577 3.3100 2.5244 2.0266 2.7675 1.8346 1.6570 1.5290 2.1244 2.0844 2.1369 2.5474 1.8815 2.3992 1.3652 1.3053 1.1107 1.5538 1.6154 1.3766 1.5156 1.6389 1.7156 2.3176 1.6312 1.5470 1.4846 1.8960 1.2754 1.3304 2.0500 1.9279 1.4008 1.5194 1.5760 2.3068 1.6536 1.4281 1.1485 1.1271 1.1457 1.0903 1.0758 1.6935 3.0229 2.9731 1.0741 1.0870 1.0773 1.0541 1.0516 1.0566 5.0744 5.6091 8.2413 1.0810 1.0465 1.0582 1.0633 1.0327 1.0351 1.0559 1.1034 1.0917 1.1018 1.1071 1.0999 1.1052 1.1050 1.1049 1.1040 1.0916 1.0912 1.0966 1.0968 1.1008 1.1010
irintensity: 0.4652 1.1451 1.5661 0.3916 1.5744 4.8347 0.4850 2.4449 3.8472 2.6367 0.1167 0.5655 0.8582 5.5301 1.4509 1.5320 0.0902 0.3069 0.3415 1.3282 0.5583 6.1610 9.7695 1.0292 2.5173 1.1448 4.3185 2.4480 0.0566 0.1587 0.9539 1.9476 6.5618 5.7749 3.4382 4.8742 1.6568 1.0370 119.3917 71.4641 20.7835 19.9321 1.6507 122.2083 7.0519 16.2253 1.4139 13.3814 1.1328 7.2104 0.4892 13.3551 12.4370 5.5808 3.6588 17.8460 0.3155 110.1894 18.1307 54.0868 10.3592 3.6342 0.5990 1.4007 7.1436 0.3123 1.2613 1.9857 22.4349 24.4079 3.1746 1.6133 14.9219 32.0456 23.2052 19.8741 11.9452 22.4107 4.3016 18.8760 2.9173 8.6658 4.0978 15.5448 17.6175 6.0118 5.7377 3.3854 7.5962 38.0155 41.6559 11.5219 5.5224 10.3738 45.3934 17.2783 35.6622 56.8168 1.3768 8.9428 64.8849 16.6046 29.1323 40.4787 26.6805 4.0929 5.1708 13.1251 41.8959 4.6455 1.1294 5.5591 17.5068 0.9458 3.5918 7.8981 2.1089 2.8932 1.4346 1.3025 0.9026 3.0932 2.3562
temp: 298.150 k
press: 1.00000 atm
elementType: 16 16 8 7 6 6 6 6 6 6 6 6 6 6 6 6 6 6 6 6 6 1 1 1 1 1 1 1 1 1 1 1 1 1 1 1 1 1 1 1 1 1 1
symmnumber: 1
zpe: 926715.8 jmol-1
zpe.correction: 0.352967 hartree
zpe.thermalcorrener: 0.374280 hartree
zpe.thermalcorrenthalpy: 0.375225 hartree
zpe.thermalcorrgfe: 0.302139 hartree
zpe.sumelectzpe: -1585.236172 hartree
zpe.sumelectthermal: -1585.214859 hartree
zpe.sumelectthermalent: -1585.213915 hartree
zpe.sumelectthermalfe: -1585.287000 hartree
dipole: -2.7823 -4.8392 2.9876
dipole: 6.3312
quadrupole: -99.8026 -87.9015 -131.0054
quadrupole: 7.2587 -3.4279 -4.7702
quadrupole: 6.4339 18.3350 -24.7689 7.2587 -3.4279 -4.7702
hfenergy: -1585.5891391 hartree
pointgroup: C01[X(C17H22N1O1S2)]
dipole: 1.2846998 -1.9483688 -0.8706185 debye
polarizability: 283.9154634|2.721756|255.4121686|0.8846493|-35.6549403|164.1305422 unknown
InChI: InChI=1S/C17H22NOS2/c1-18(2)11-13(10-14(12-18)19-3)17(15-6-4-8-20-15)16-7-5-9-21-16/h4-9,14H,10-12H2,1-3H3
charge 1 multiplicity 1
43 atoms
S  -2.323542 -1.863749 1.704146
S  0.036375 2.439432 -1.248043
O  4.130441 0.827404 0.498568
N  1.984647 -2.148012 -0.244446
C  3.199055 -1.247376 0.028452
C  0.818624 -1.780358 0.756905
C  2.870575 0.260459 0.026738
C  1.669676 0.57011 0.956724
C  0.478411 -0.31847 0.63718
C  2.388745 -3.59892 -0.011893
C  1.49983 -1.987798 -1.680779
C  -0.790665 0.130126 0.282331
C  -1.98234 -0.745154 0.300137
C  -1.073338 1.519048 -0.125175
C  4.244084 2.285954 0.32936
C  -3.04072 -0.793766 -0.60809
C  -2.205757 2.287458 0.147311
C  -4.08656 -1.715086 -0.255066
C  -2.210342 3.584694 -0.471338
C  -3.862977 -2.37067 0.946569
C  -1.093515 3.82775 -1.255814
H  3.972762 -1.479295 -0.722022
H  3.584956 -1.511453 1.028752
H  1.219053 -2.049514 1.753191
H  -0.014685 -2.453683 0.50515
H  2.652867 0.625518 -1.001947
H  1.408555 1.63731 0.906255
H  2.004489 0.360501 1.995583
H  1.520677 -4.249914 -0.19783
H  3.207333 -3.862022 -0.69983
H  2.726597 -3.716809 1.02901
H  1.121438 -0.966738 -1.825872
H  2.339786 -2.18585 -2.364495
H  0.685823 -2.706423 -1.862089
H  3.552295 2.829367 1.000281
H  4.05175 2.580262 -0.721859
H  5.281697 2.530992 0.598736
H  -3.061503 -0.177781 -1.510611
H  -3.011647 1.925264 0.790057
H  -4.977645 -1.881071 -0.864063
H  -3.014179 4.312546 -0.343518
H  -4.489482 -3.098697 1.459458
H  -0.842244 4.709813 -1.842614
