program: Gaussian 09
title: 000043755
version: EM64L-G09RevD.01
frameworkgroup: C1[X(C13H17BrN2O2)]
method: RPBEPBE
basis: SDD
operation: Freq
keyword: #p
keyword: freq=noraman
keyword: PBEPBE/SDD
title: #p freq=noraman PBEPBE/SDD
converged: YES YES NO NO
title: Mulliken charges:
elementType: Br O O N N C C C C C C C C C C C C C H H H H H H H H H H H H H H H H H
charge: 0.015843 -0.246025 -0.261062 -0.101598 0.007572 -0.337346 -0.347961 -0.356947 -0.319116 -0.315356 -0.275483 0.437398 -0.349230 -0.368271 -0.355798 -0.180940 -0.176252 -0.208149 0.194770 0.205170 0.213592 0.193763 0.198792 0.220661 0.193652 0.215934 0.215294 0.194003 0.225648 0.211924 0.243621 0.235048 0.271497 0.253254 0.252098
chargesum: 0.00000
title: Mulliken charges with hydrogens summed into heavy atoms:
elementType: Br O O N N C C C C C C C C C C C C C
charge: 0.015843 -0.246025 -0.261062 -0.101598 0.007572 0.062594 0.059394 0.062507 0.090469 0.093940 0.162090 0.437398 -0.105610 -0.133223 -0.084301 0.072314 0.075846 -0.208149
polarizability: 3.41302815e+02 1.14082236e+01 1.56830399e+02 2.41604130e+00 -5.31178035e+00 1.00644862e+02
1716.lowfreq: -33.5349 -5.5074 -3.8332 -0.0008 -0.0005 -0.0004 4.7695 21.1151 25.9132
frequency: -21.8961 20.9024 25.5871 47.7935 61.8641 93.0519 96.8964 135.7120 160.0711 177.1498 194.9884 217.5893 234.4320 270.5980 287.2289 314.4330 353.2047 374.5347 394.8101 409.4376 414.1451 466.0007 488.0317 515.3483 528.2369 600.8555 623.8183 661.0461 717.2189 763.1764 803.2306 811.1823 826.7079 837.9140 842.5799 842.9660 899.0878 909.1036 941.8181 967.6469 982.8534 990.7297 996.3613 1002.8205 1026.6313 1051.6298 1058.0130 1060.9081 1079.6191 1091.8922 1111.2799 1111.4594 1135.6895 1153.5774 1184.9502 1188.6985 1201.1518 1225.9436 1247.6345 1266.3635 1286.8815 1293.0877 1295.6926 1314.4843 1330.1528 1337.8779 1347.7277 1362.9978 1368.1358 1371.5006 1396.0786 1400.4888 1441.8391 1447.4514 1449.0172 1458.3392 1472.6100 1475.5900 1489.7112 1547.7699 1581.3583 1595.6084 2861.4819 2869.3198 2888.6569 2954.2906 2958.3530 3000.5295 3029.5781 3036.2648 3038.8996 3061.8729 3075.1255 3080.5209 3083.6997 3133.4383 3154.1450 3170.5387 3175.1095
redmass: 3.4663 5.2350 6.2217 5.1364 3.1673 3.0354 6.2834 7.3241 4.2763 3.7785 8.5079 4.2536 1.8201 6.8815 5.1400 2.3311 4.8897 3.1033 2.5766 2.9248 4.4843 2.7904 5.9949 2.8319 4.6590 2.0120 7.0928 6.0109 3.5347 3.9017 1.9275 1.6744 1.3350 2.1518 1.6383 2.0127 2.3217 7.3733 1.3842 1.4475 1.3627 6.0746 4.4339 3.1869 2.1878 2.3376 2.5875 2.1470 2.2223 3.5068 1.3913 2.2872 2.5085 1.8473 1.1132 1.0704 1.3332 1.8447 1.3064 1.2734 1.2098 1.2934 1.3001 1.3686 1.3584 1.5630 1.4139 2.0255 1.8614 1.3813 3.5823 1.5179 1.0822 1.0790 1.0973 1.0992 2.5156 1.0811 1.0847 7.2956 6.8577 6.0838 1.0706 1.0694 1.0694 1.0665 1.0665 1.0573 1.0899 1.0889 1.0893 1.0894 1.1084 1.0961 1.0979 1.0897 1.0885 1.0956 1.0975
irintensity: 0.0339 0.0342 0.1253 0.1951 0.3189 0.8089 1.7334 0.3238 3.2427 12.1115 0.3166 1.7079 1.9868 11.1667 0.9155 14.0739 0.0242 4.2965 2.6606 0.0019 1.3811 2.1620 3.2844 36.1295 81.5611 4.3214 1.8835 0.6741 1.8597 17.0702 18.9879 21.7298 24.2870 12.1327 20.9887 27.2813 8.0727 209.5810 21.4840 15.0437 1.3295 297.9565 63.9351 1.2199 9.6434 23.6566 46.4516 4.2263 1.6432 57.0248 7.7697 2.6114 67.7882 2.1026 0.4030 1.9003 2.8930 14.4702 16.9034 5.2179 17.5166 4.4649 1.8357 22.1699 0.3437 2.3194 3.6678 1.4384 2.7220 0.3473 9.1002 2.1220 2.4161 0.4480 20.0895 7.1414 70.8653 10.7991 22.3461 8.1285 4.1622 23.7260 50.7059 76.5177 124.8231 30.4151 104.3742 59.2646 31.8797 27.4329 36.5929 15.2987 48.2067 41.9512 38.7515 9.6717 0.7889 8.3126 1.6440
temp: 298.150 k
press: 1.00000 atm
elementType: 35 8 8 7 7 6 6 6 6 6 6 6 6 6 6 6 6 6 1 1 1 1 1 1 1 1 1 1 1 1 1 1 1 1 1
symmnumber: 1
zpe: 736509.8 jmol-1
zpe.correction: 0.280522 hartree
zpe.thermalcorrener: 0.297508 hartree
zpe.thermalcorrenthalpy: 0.298452 hartree
zpe.thermalcorrgfe: 0.232638 hartree
zpe.sumelectzpe: -777.540043 hartree
zpe.sumelectthermal: -777.523058 hartree
zpe.sumelectthermalent: -777.522113 hartree
zpe.sumelectthermalfe: -777.587928 hartree
dipole: 0.5063 1.3886 -0.0525
dipole: 1.4790
quadrupole: -140.4954 -106.0765 -117.9360
quadrupole: 1.9383 4.1034 0.0228
quadrupole: -18.9927 15.4261 3.5667 1.9383 4.1034 0.0228
hfenergy: -777.8205652 hartree
pointgroup: C01 [X(C13H17Br1N2O2)]
dipole: -0.1757642 -0.5495149 -0.0755664 debye
polarizability: 340.0465866|18.7989335|156.5657677|3.0413206|10.8055273|102.1657209 unknown
InChI: InChI=1S/C13H17BrN2O2/c14-13-3-1-12(2-4-13)11-15-18-10-7-16-5-8-17-9-6-16/h1-4,11H,5-10H2
charge 0 multiplicity 1
35 atoms
Br 7.727079 1.062996 0.378125
O  -6.787323 0.817752 -0.113282
O  -0.424972 -0.948523 -0.220002
N  -4.055174 -0.148462 0.144692
N  0.807758 -0.208249 0.005319
C  -4.409115 0.924879 -0.823264
C  -5.219196 -1.050636 0.35095
C  -2.825861 -0.887882 -0.225599
C  -5.632113 1.706898 -0.316297
C  -6.428672 -0.240954 0.845219
C  -1.569622 -0.065976 0.098434
C  3.215628 -0.474667 -0.077279
C  1.845948 -0.983877 -0.228522
C  4.308348 -1.345535 -0.339537
C  3.48843 0.864759 0.324629
C  5.641829 -0.901694 -0.207864
C  4.813475 1.319602 0.459471
C  5.878771 0.429453 0.190996
H  -4.639574 0.498074 -1.832547
H  -3.557681 1.620967 -0.934805
H  -4.953795 -1.811305 1.109202
H  -5.500028 -1.583816 -0.59236
H  -2.812343 -1.185215 -1.302886
H  -2.787921 -1.818851 0.369772
H  -5.377357 2.214511 0.639116
H  -5.960824 2.453871 -1.057678
H  -7.324807 -0.877379 0.932183
H  -6.193239 0.211673 1.832719
H  -1.550041 0.204102 1.169488
H  -1.490747 0.853381 -0.510557
H  1.708372 -2.031762 -0.541516
H  4.117848 -2.380018 -0.649183
H  2.651713 1.540072 0.52848
H  6.475835 -1.579077 -0.411709
H  5.01807 2.348785 0.768192
