program: Gaussian 09
title: 000005378
version: EM64L-G09RevD.01
frameworkgroup: C1[X(C21H29N5O2)]
method: RPBEPBE
basis: SDD
operation: Freq
keyword: #p
keyword: freq=noraman
keyword: PBEPBE/SDD
title: #p freq=noraman PBEPBE/SDD
converged: YES YES NO NO
title: Mulliken charges:
elementType: O O N N N N N C C C C C C C C C C C C C C C C C C C C C H H H H H H H H H H H H H H H H H H H H H H H H H H H H H
charge: -0.216744 -0.204624 -0.156856 -0.092212 -0.116837 -0.091372 -0.090565 -0.176901 -0.179412 -0.224431 -0.219529 -0.521947 -0.468358 -0.468536 0.097247 0.092195 -0.387715 -0.359128 -0.436491 -0.377470 -0.350261 -0.346848 -0.392483 -0.399709 0.109979 -0.281751 -0.281914 -0.199882 0.271385 0.271807 0.266587 0.264794 0.247248 0.232346 0.236802 0.209714 0.236992 0.209828 0.236449 0.250107 0.228768 0.228726 0.211586 0.208929 0.185448 0.265386 0.218413 0.189350 0.193693 0.212074 0.264486 0.212385 0.212393 0.264541 0.240124 0.240373 0.231822
chargesum: 0.00000
title: Mulliken charges with hydrogens summed into heavy atoms:
elementType: O O N N N N N C C C C C C C C C C C C C C C C C C C C C
charge: -0.216744 -0.204624 -0.156856 -0.092212 -0.116837 -0.091372 -0.090565 0.094484 0.092395 0.042156 0.045265 -0.042353 -0.021842 -0.021716 0.097247 0.092195 0.098841 0.098366 -0.015976 0.073364 0.057501 0.058919 0.084388 0.077225 0.109979 -0.041627 -0.041541 0.031939
polarizability: 3.72287219e+02 1.01931009e+01 2.34087883e+02 -3.07223107e+00 1.80809411e+00 1.81602401e+02
1716.lowfreq: -15.0592 -0.0011 0.0002 0.0008 1.8031 6.3933 9.5156 17.9431 26.7900
frequency: 5.5893 17.2679 26.0972 29.8123 43.9757 51.8976 76.9428 82.0439 93.1697 110.8101 138.8036 145.0699 160.6966 184.3240 202.5565 217.1845 262.9078 265.5737 278.3520 292.7503 309.5711 315.9091 331.4957 343.0141 375.4414 407.5253 409.7936 447.9238 463.7123 465.0449 479.8748 495.5230 513.5997 518.4621 556.8427 575.0821 584.4165 615.6447 624.1082 627.3551 627.9705 707.2990 730.2694 746.0450 758.1575 774.8331 778.1546 787.1336 790.6564 791.4063 808.9859 811.0754 842.4293 866.8481 882.1180 896.3206 903.9058 919.9959 923.9550 935.5647 947.5957 950.5468 952.8406 954.9386 962.2892 963.0228 964.8096 974.1229 1013.9202 1020.6777 1027.8462 1043.1860 1045.0546 1051.6386 1052.0259 1060.4597 1063.7480 1074.7361 1088.4423 1104.8659 1112.0191 1119.4946 1124.9223 1139.3738 1140.4125 1148.2679 1162.9710 1174.9734 1187.6839 1191.8637 1195.9600 1206.4394 1208.7849 1228.4012 1236.7182 1248.3393 1251.1512 1260.3753 1265.4695 1270.4960 1275.4508 1290.9260 1291.1408 1292.0636 1295.2789 1298.3395 1302.8291 1314.0611 1317.5046 1328.5963 1334.9924 1340.7940 1350.8733 1354.5862 1360.4271 1367.3283 1371.5081 1383.9386 1395.4353 1405.7820 1450.2969 1454.3561 1458.5666 1460.9715 1462.3719 1467.4750 1468.5986 1470.6639 1476.4447 1492.2980 1493.5048 1505.4752 1523.1408 1571.6428 1614.1708 1680.9731 2847.3025 2851.3314 2865.1336 2972.9682 2977.6165 2980.6522 2999.4686 3000.3248 3013.6256 3017.8481 3020.5924 3023.7574 3036.2391 3037.6432 3040.2840 3045.5543 3050.8801 3054.2953 3060.1608 3077.0693 3081.1603 3084.2682 3090.3435 3090.5988 3103.2031 3104.5263 3124.0917 3124.7801 3187.1168
redmass: 4.7910 5.2821 4.8027 4.8883 5.9378 4.8122 4.7960 3.9380 4.2410 4.6427 3.5557 5.0761 5.9423 4.3523 3.7162 2.8504 1.9221 2.1763 2.5608 3.6382 3.3486 4.0878 2.2911 3.4482 2.3654 4.1173 1.9883 2.0421 4.8975 2.7314 2.7390 4.1735 2.7667 3.5001 4.3174 3.9258 4.1239 2.4041 5.9924 7.7992 6.6530 1.8367 5.1530 3.5936 4.3238 2.5958 1.8028 4.6687 2.1438 2.5664 2.2546 2.4143 1.5629 2.3014 2.2869 2.5746 2.5597 4.2869 3.1242 2.2725 2.4104 2.2578 1.3722 2.0977 1.5658 2.7413 1.7060 2.0904 1.6005 2.2019 1.9456 1.4687 2.6044 1.7862 1.7455 2.5555 2.4228 1.6715 2.0810 1.1424 2.4185 2.3134 1.3732 2.6529 2.4581 2.0760 2.3343 1.8586 1.5290 1.9297 1.1248 1.6405 1.2069 1.6135 1.4408 1.7087 2.0871 1.3764 1.7386 1.3555 1.6394 1.6611 1.3850 1.3389 1.4613 1.6069 1.9673 1.7520 1.5191 1.2867 1.9581 1.2929 1.6491 1.4006 1.4692 1.4104 1.4328 1.6881 1.3825 1.8647 1.0887 1.0972 1.0806 1.0976 1.1033 1.0801 1.0956 1.0953 1.0898 1.0856 1.0988 5.6209 4.3316 5.7310 12.0545 11.2514 1.0714 1.0711 1.0694 1.0681 1.0682 1.0611 1.0624 1.0587 1.0614 1.0612 1.0894 1.0647 1.0902 1.0854 1.0908 1.0893 1.0870 1.1046 1.1014 1.1048 1.0880 1.1054 1.1029 1.0940 1.0933 1.0946 1.0903 1.0925 1.0981
irintensity: 0.0587 0.1122 0.0261 0.0472 0.8634 0.1876 1.0294 0.2957 2.7727 3.4830 2.0289 3.2398 7.1584 1.8884 2.1200 3.6415 0.1697 4.5751 1.3241 5.4467 3.4069 12.6855 10.0670 10.9213 6.2273 0.0006 0.1635 0.6769 2.1206 0.6448 1.7092 10.8126 2.3857 4.0421 3.5385 1.4926 3.3799 5.0056 2.9144 3.3137 1.9214 38.8072 1.8080 3.3641 10.2587 2.2518 14.5153 7.4057 20.0902 40.5145 6.0591 7.2124 0.0903 6.0766 7.0864 2.9615 12.6568 4.5150 2.3643 3.7285 2.9966 5.2206 0.0022 0.9104 12.0431 74.1984 5.4779 53.6763 8.0159 24.9487 5.5181 0.3538 2.9459 0.1674 1.2401 4.9061 1.0573 0.3607 17.5090 5.0346 0.4515 0.9920 3.5172 43.0553 50.2719 0.7010 87.4338 7.4654 33.9546 20.1472 0.4008 4.7997 0.0769 12.3978 12.6426 3.3155 30.2021 2.7500 44.8826 0.5975 30.7637 2.2581 15.7818 4.6656 5.0554 19.7323 38.1668 104.2152 17.0060 16.6684 114.2227 11.3353 9.2790 106.7604 10.6724 13.6843 29.8247 79.8879 1.5405 0.0395 17.7237 8.1823 6.4282 46.9132 45.9646 3.7861 11.9480 11.5009 14.2967 13.3937 10.2689 79.8363 202.1921 679.2065 475.7154 35.1517 26.9129 46.0500 176.3004 29.1140 78.3306 44.2089 17.1385 31.3506 78.3961 17.3895 21.7685 18.6642 8.4005 5.8925 71.3071 49.4093 9.1758 1.1424 36.9138 33.4599 36.1376 54.7370 11.9585 13.4750 4.6082 6.2052 28.5571 31.3983 18.5281
temp: 298.150 k
press: 1.00000 atm
elementType: 8 8 7 7 7 7 7 6 6 6 6 6 6 6 6 6 6 6 6 6 6 6 6 6 6 6 6 6 1 1 1 1 1 1 1 1 1 1 1 1 1 1 1 1 1 1 1 1 1 1 1 1 1 1 1 1 1
symmnumber: 1
zpe: 1263889.4 jmol-1
zpe.correction: 0.481390 hartree
zpe.thermalcorrener: 0.505954 hartree
zpe.thermalcorrenthalpy: 0.506898 hartree
zpe.thermalcorrgfe: 0.422985 hartree
zpe.sumelectzpe: -1239.751207 hartree
zpe.sumelectthermal: -1239.726643 hartree
zpe.sumelectthermalent: -1239.725698 hartree
zpe.sumelectthermalfe: -1239.809611 hartree
dipole: 2.4143 -0.9465 1.4049
dipole: 2.9493
quadrupole: -136.1683 -176.9466 -165.3456
quadrupole: -8.1249 2.4772 6.4947
quadrupole: 23.3185 -17.4598 -5.8587 -8.1249 2.4772 6.4947
hfenergy: -1240.2325966 hartree
pointgroup: C01 [X(C21H29N5O2)]
dipole: 0.9524585 0.3906682 -0.5353656 debye
polarizability: 372.1467739|-11.2204645|233.959778|2.6524569|4.1380022|181.870951 unknown
InChI: InChI=1S/C21H29N5O2/c27-19-17-15-4-5-16(14-15)18(17)20(28)26(19)9-2-1-8-24-10-12-25(13-11-24)21-22-6-3-7-23-21/h3,6-7,15-18H,1-2,4-5,8-14H2
charge 0 multiplicity 1
57 atoms
O  2.429777 1.630274 -0.380767
O  4.064584 -2.573523 0.893449
N  2.965622 -0.557628 0.339497
N  -1.701866 -0.15504 -0.374858
N  -4.464184 -0.08955 0.414693
N  -6.598599 -0.825325 -0.282222
N  -6.270166 1.409496 0.685584
C  5.631898 1.662078 0.008802
C  6.432365 -0.389982 0.638694
C  4.704615 0.660713 -0.758391
C  5.254005 -0.742636 -0.331137
C  5.897835 0.894816 1.337392
C  7.033696 1.60165 -0.671125
C  7.586069 0.190852 -0.234399
C  3.251739 0.68386 -0.277669
C  4.07941 -1.435417 0.363261
C  1.656289 -0.904212 0.930369
C  0.801954 -1.819766 0.022766
C  0.400754 -1.200098 -1.335006
C  -0.499586 0.053571 -1.222838
C  -2.361304 1.129256 -0.022112
C  -2.682519 -1.0940 -0.975326
C  -3.516818 0.894783 0.970649
C  -3.849667 -1.362631 -0.004204
C  -5.808717 0.171253 0.268511
C  -7.921142 -0.545426 -0.407783
C  -7.600186 1.638012 0.537818
C  -8.493528 0.685942 -0.008808
H  5.2019 2.671942 0.0930
H  6.721918 -1.228648 1.290315
H  4.725087 0.849994 -1.845496
H  5.600602 -1.374319 -1.166976
H  4.993668 0.731177 1.949956
H  6.662242 1.3856 1.964382
H  7.678384 2.416203 -0.295479
H  6.966795 1.711848 -1.768397
H  8.507654 0.292189 0.366099
H  7.820913 -0.459786 -1.095781
H  1.854904 -1.420746 1.886435
H  1.134898 0.046093 1.136036
H  1.348616 -2.767566 -0.140653
H  -0.118064 -2.057136 0.589237
H  -0.099924 -1.979912 -1.941593
H  1.305423 -0.911339 -1.906925
H  -0.7824 0.381925 -2.25643
H  0.088269 0.878452 -0.78029
H  -1.610547 1.794872 0.44239
H  -2.764721 1.648779 -0.928848
H  -3.091501 -0.693836 -1.938795
H  -2.180223 -2.052875 -1.195308
H  -4.065662 1.82638 1.173946
H  -3.103106 0.499865 1.92082
H  -3.458856 -1.886475 0.892087
H  -4.62712 -1.983058 -0.474602
H  -8.53537 -1.341868 -0.844856
H  -7.952721 2.621438 0.871345
H  -9.560785 0.889785 -0.117154
