program: Gaussian 09
title: 000043749
version: EM64L-G09RevD.01
frameworkgroup: C1[X(C14H20N2O2)]
method: RPBEPBE
basis: SDD
operation: Freq
keyword: #p
keyword: freq=noraman
keyword: PBEPBE/SDD
title: #p freq=noraman PBEPBE/SDD
converged: YES YES NO NO
title: Mulliken charges:
elementType: O O N N C C C C C C C C C C C C C C H H H H H H H H H H H H H H H H H H H H
charge: -0.246798 -0.265650 -0.101194 0.002922 -0.337053 -0.347106 -0.357397 -0.319486 -0.315650 -0.273417 0.426751 -0.354163 0.443148 -0.374926 -0.364862 -0.388755 -0.372597 -0.804062 0.193717 0.205840 0.213198 0.192816 0.197645 0.219690 0.193451 0.214971 0.214273 0.193733 0.222523 0.209108 0.240137 0.224947 0.262360 0.231152 0.230640 0.225595 0.237644 0.226856
chargesum: 0.00000
title: Mulliken charges with hydrogens summed into heavy atoms:
elementType: O O N N C C C C C C C C C C C C C C
charge: -0.246798 -0.265650 -0.101194 0.002922 0.062504 0.058907 0.059938 0.088936 0.092356 0.158214 0.426751 -0.114026 0.443148 -0.149979 -0.102502 -0.157603 -0.141957 -0.113967
polarizability: 3.07855820e+02 9.25155090e+00 1.59401755e+02 -3.03955007e+00 6.22755100e+00 1.07223884e+02
1716.lowfreq: -9.7044 -0.0008 0.0001 0.0012 2.9314 8.7425 11.6304 19.8374 28.9034
frequency: 1.4285 18.7382 27.2238 33.0264 59.2413 67.1355 102.4991 110.0311 154.0576 175.7201 178.7648 211.4783 234.7485 253.9616 317.2464 326.9059 352.1482 364.9418 382.7597 403.8091 409.4226 467.2603 468.5039 519.8091 524.2162 566.5530 608.4846 637.0947 724.7533 756.7019 773.8646 804.3816 813.1432 826.9021 839.9885 850.0389 853.8929 899.9489 901.6858 942.3147 968.9045 985.9150 986.9293 996.8763 1004.7624 1011.7211 1028.7209 1046.2638 1052.3113 1061.7703 1079.6970 1093.7562 1112.9315 1123.4314 1136.6750 1155.4270 1189.2274 1189.3844 1200.8408 1224.3810 1228.4999 1248.1324 1267.1538 1287.1684 1292.8981 1310.7712 1315.8648 1330.1333 1338.5225 1349.3428 1365.8981 1370.1122 1372.2940 1396.1636 1399.8436 1413.0820 1442.0948 1447.3814 1450.6666 1459.7577 1469.5339 1471.6331 1475.9800 1490.6473 1506.9675 1550.6253 1584.4149 1622.6105 2861.0945 2867.6857 2888.6242 2954.8227 2958.4474 2973.7865 2997.8790 3027.6937 3036.3570 3039.6596 3055.0345 3055.5867 3071.2475 3080.1272 3083.2965 3085.0398 3115.3657 3123.0307 3139.7168 3158.8619
redmass: 1.0333 3.3927 4.0934 4.7944 3.8438 2.8686 3.1124 5.0842 5.0848 3.4067 4.1698 5.0667 1.9428 3.1266 2.3870 2.9227 6.8172 3.8656 2.4763 2.3551 2.8792 6.0721 2.7899 2.5654 4.4366 4.0773 2.1984 6.8809 2.9795 4.0165 4.2288 1.8305 1.7409 1.3982 1.6441 4.6281 1.2698 2.3030 6.9778 1.3681 1.4435 1.4010 1.3874 4.6985 3.3660 2.8611 2.1775 1.5714 2.2936 2.1621 2.2278 3.4743 2.2448 1.3240 2.4370 1.8782 1.0699 1.1176 1.3421 2.4999 2.0804 1.3128 1.2731 1.2219 1.3010 1.4206 1.3172 1.3560 1.5176 1.3860 1.7282 1.9855 1.5526 1.2251 1.4848 3.5747 1.0823 1.0803 1.0973 1.0988 1.1021 1.0563 1.0814 1.0844 2.7988 6.2018 6.1670 6.3123 1.0706 1.0695 1.0694 1.0664 1.0664 1.0388 1.0570 1.0901 1.0893 1.0891 1.0945 1.0892 1.1079 1.0963 1.0980 1.0999 1.0871 1.0891 1.0966 1.0957
irintensity: 0.5433 0.0310 0.1238 0.1056 1.2877 0.6255 1.2700 1.0404 0.6690 9.8517 4.6309 1.9106 3.2264 3.3888 15.0793 1.8508 0.4196 0.1318 2.7849 1.9918 0.1209 0.8978 2.0271 30.6302 48.4115 26.7542 4.3677 1.4843 2.8220 16.7459 1.6028 14.7145 22.2308 38.1488 0.4473 11.2384 4.1425 12.3200 199.1095 15.0954 18.9491 4.2793 5.5199 263.3558 9.1360 5.3066 10.1236 20.0347 22.8196 6.1850 0.9332 58.5553 2.5491 11.0192 67.8158 1.7269 1.8062 8.0249 2.7836 0.1484 19.5544 15.8115 5.1877 17.9756 4.0763 10.9050 13.6595 0.2231 2.5406 3.6210 1.0682 2.1944 0.1302 8.7204 1.4446 3.2096 2.5119 0.8958 19.8144 6.6942 14.6055 12.8088 8.9752 20.3300 23.1452 2.1192 0.6178 12.6864 50.0070 79.5591 123.5701 30.4261 105.4586 39.8190 63.3039 33.5250 23.8151 35.6442 24.4189 15.0464 54.1612 42.2201 38.7459 17.8655 13.3535 20.6395 28.0427 4.4915
temp: 298.150 k
press: 1.00000 atm
elementType: 8 8 7 7 6 6 6 6 6 6 6 6 6 6 6 6 6 6 1 1 1 1 1 1 1 1 1 1 1 1 1 1 1 1 1 1 1 1
symmnumber: 1
zpe: 834074.1 jmol-1
zpe.correction: 0.317682 hartree
zpe.thermalcorrener: 0.335985 hartree
zpe.thermalcorrenthalpy: 0.336929 hartree
zpe.thermalcorrgfe: 0.265026 hartree
zpe.sumelectzpe: -803.980455 hartree
zpe.sumelectthermal: -803.962152 hartree
zpe.sumelectthermalent: -803.961208 hartree
zpe.sumelectthermalfe: -804.033111 hartree
dipole: 2.5189 -0.5209 0.0054
dipole: 2.5722
quadrupole: -104.4138 -99.0971 -109.9256
quadrupole: 5.3450 -3.5202 -0.0860
quadrupole: 0.0651 5.3817 -5.4468 5.3450 -3.5202 -0.0860
hfenergy: -804.298137 hartree
pointgroup: C01 [X(C14H20N2O2)]
dipole: 0.9910919 -0.2045877 -0.0045417 debye
polarizability: 307.8654961|9.3937082|158.6995285|-1.9837007|8.6976152|107.9164343 unknown
InChI: InChI=1S/C14H20N2O2/c1-13-2-4-14(5-3-13)12-15-18-11-8-16-6-9-17-10-7-16/h2-5,12H,6-11H2,1H3
charge 0 multiplicity 1
38 atoms
O  -6.800079 0.776624 -0.119487
O  -0.421549 -0.927344 -0.214427
N  -4.060092 -0.165207 0.150746
N  0.806614 -0.165632 0.00447
C  -4.41854 0.906692 -0.816587
C  -5.216658 -1.07891 0.346599
C  -2.821307 -0.892269 -0.214254
C  -5.651308 1.676299 -0.314734
C  -6.436488 -0.282644 0.836922
C  -1.572484 -0.05859 0.108672
C  3.220566 -0.417946 -0.095322
C  1.851426 -0.931614 -0.232637
C  5.926754 0.499396 0.153078
C  4.313315 -1.289679 -0.354364
C  3.500218 0.923806 0.293292
C  5.642813 -0.836374 -0.229763
C  4.829246 1.366584 0.414426
C  7.356804 0.997822 0.257038
H  -4.638844 0.480283 -1.828383
H  -3.573057 1.610929 -0.921403
H  -4.948402 -1.840088 1.103379
H  -5.486704 -1.611386 -0.600384
H  -2.802348 -1.191937 -1.290869
H  -2.775729 -1.821361 0.383403
H  -5.405952 2.183489 0.643298
H  -5.983253 2.421845 -1.056125
H  -7.327311 -0.927512 0.916304
H  -6.210488 0.168681 1.827167
H  -1.553771 0.211269 1.180134
H  -1.506065 0.863547 -0.498124
H  1.718301 -1.981773 -0.541256
H  4.116882 -2.327955 -0.650056
H  2.663802 1.599765 0.498853
H  6.471178 -1.526573 -0.430297
H  5.027904 2.401931 0.717916
H  8.056364 0.177165 0.494273
H  7.690371 1.448363 -0.698462
H  7.460071 1.773303 1.036568
