program: Gaussian 09
title: 000005358
version: EM64L-G09RevD.01
frameworkgroup: C1[X(C14H21N3O2S)]
method: RPBEPBE
basis: SDD
operation: Freq
keyword: #p
keyword: freq=noraman
keyword: PBEPBE/SDD
title: #p freq=noraman PBEPBE/SDD
converged: YES YES NO NO
title: Mulliken charges:
elementType: S O O N N N C C C C C C C C C C C C C C H H H H H H H H H H H H H H H H H H H H H
charge: 0.970848 -0.553076 -0.564255 -0.402068 -0.079559 -0.495916 0.387827 0.116514 -0.563594 0.237035 0.543626 -0.357746 -0.532183 -0.433702 -0.793359 -0.343045 -0.350749 -0.617395 -0.621839 -0.602985 0.226830 0.215085 0.221584 0.212886 0.251367 0.272247 0.274002 0.275454 0.308835 0.231762 0.238527 0.224786 0.195840 0.218853 0.220697 0.192929 0.225707 0.309238 0.229741 0.267797 0.241454
chargesum: 0.00000
title: Mulliken charges with hydrogens summed into heavy atoms:
elementType: S O O N N N C C C C C C C C C C C C C C
charge: 0.970848 -0.553076 -0.564255 -0.093233 -0.079559 -0.186678 0.387827 0.116514 -0.121679 0.237035 0.543626 0.076725 -0.280815 -0.161455 -0.243904 -0.111283 -0.112222 0.022085 0.017493 0.136007
polarizability: 3.10489496e+02 3.11930848e+01 2.34518926e+02 -9.02654785e+00 -1.61671562e+01 1.41740157e+02
1716.lowfreq: -8.5680 -3.4630 -0.0021 -0.0013 -0.0009 4.0739 15.7020 22.2564 24.2377
frequency: 15.3690 22.1192 24.1511 34.2813 43.6857 53.5987 68.0660 82.1502 108.5867 127.3382 152.9222 164.1687 177.0079 198.6483 205.4489 221.4909 241.0625 246.5865 253.0781 263.4841 317.9476 327.7773 335.1217 356.7309 388.2696 420.1964 425.0529 437.8704 445.2699 477.7969 497.7825 515.5075 529.5508 578.0779 609.7371 659.7579 713.6763 748.4948 765.3978 789.3062 796.5430 799.6970 805.6269 813.3668 819.9599 836.2907 874.1350 899.5099 924.5285 944.2145 955.7902 1008.1449 1012.8051 1014.9485 1031.1843 1055.5537 1063.1980 1069.2557 1089.7606 1090.0547 1092.6810 1113.5901 1126.8058 1151.5456 1155.8607 1199.7096 1216.2317 1223.6732 1241.4210 1259.7101 1262.6496 1292.5742 1298.3649 1311.7357 1323.1165 1334.1428 1369.1262 1396.3513 1413.6218 1416.5571 1422.0505 1433.1241 1441.0785 1458.6573 1461.4557 1462.8920 1471.9399 1473.1804 1476.3997 1479.3716 1481.2505 1481.2996 1488.3391 1564.4994 1588.6012 1628.5525 2848.2234 2853.4994 2870.6968 2966.4781 2984.6081 3018.3620 3023.6144 3027.2717 3055.3336 3057.3960 3068.9516 3076.2486 3082.1978 3094.6846 3134.2220 3139.7838 3156.7518 3159.4752 3222.8855 3357.9630 3610.1375
redmass: 4.8412 6.6628 2.6187 4.1015 4.4502 1.7495 4.0654 1.5387 2.1452 5.5444 4.4558 5.0592 3.5594 5.6048 2.7278 1.1852 2.1743 1.4786 4.8808 6.8793 4.1900 2.5944 3.0955 2.7453 4.8154 3.7781 2.8979 3.7175 2.9238 3.9573 7.2705 4.3910 1.2576 3.6654 3.1167 3.7989 4.4384 3.9013 4.3695 1.3836 1.6012 1.5123 2.5871 3.4964 2.4961 3.5057 2.4102 1.6080 4.0457 1.3765 2.7135 2.1171 2.3656 3.5675 1.6512 2.5379 2.3510 1.3692 1.3170 1.2808 1.4873 1.2697 1.3190 1.2579 1.6684 1.2061 2.0210 1.9414 2.2167 1.9048 1.7917 1.3474 1.6587 1.8923 1.2282 1.7805 1.3272 4.9011 1.1029 1.1416 1.2296 2.3337 1.1647 1.0583 1.0513 1.0777 4.2623 1.1431 1.1277 3.2151 1.0685 1.0669 1.0633 6.4403 5.7343 6.8527 1.0582 1.0657 1.0594 1.0353 1.0625 1.0735 1.0835 1.0755 1.1002 1.1006 1.0578 1.1009 1.1004 1.0984 1.0875 1.0924 1.0984 1.1109 1.0985 1.0747 1.0809
irintensity: 0.1789 3.5276 0.9083 0.1995 3.0626 4.9328 2.1039 0.3093 2.0583 3.1471 13.8629 5.5635 3.6216 2.7816 0.8631 0.8821 0.1948 2.2568 54.7586 2.3817 9.3027 5.6175 7.7016 15.5079 21.1094 42.7600 15.0845 47.4251 7.2144 42.4201 12.3081 7.1308 87.0855 14.1870 7.7701 28.5718 7.5088 2.7732 3.5813 10.6844 86.1269 11.6186 47.0524 26.9447 55.8379 10.6677 16.7025 13.4411 7.1879 2.8725 39.6911 8.9305 4.7795 8.9216 24.5563 45.3003 0.5631 47.9594 7.1145 4.4321 36.0392 7.3141 5.8052 9.2892 7.2857 84.8363 42.5824 30.9335 12.1108 9.2727 1.5221 4.8562 7.0641 16.2059 5.0587 15.3815 10.5030 67.4456 16.3426 2.7105 4.5325 6.7442 2.9509 23.6047 14.1419 9.5574 4.6135 7.1306 18.4708 6.0318 10.3009 17.0011 22.5241 0.4177 11.6486 50.4632 63.8114 75.9328 157.1897 76.9098 26.1823 49.5515 41.8276 30.1689 30.3569 25.1648 12.6337 30.4773 55.5807 5.0936 4.4731 6.9233 11.0660 1.9463 1.7248 12.3436 82.6210
temp: 298.150 k
press: 1.00000 atm
elementType: 16 8 8 7 7 7 6 6 6 6 6 6 6 6 6 6 6 6 6 6 1 1 1 1 1 1 1 1 1 1 1 1 1 1 1 1 1 1 1 1 1
symmnumber: 1
zpe: 871886.7 jmol-1
zpe.correction: 0.332084 hartree
zpe.thermalcorrener: 0.354578 hartree
zpe.thermalcorrenthalpy: 0.355522 hartree
zpe.thermalcorrgfe: 0.276813 hartree
zpe.sumelectzpe: -1257.149253 hartree
zpe.sumelectthermal: -1257.126759 hartree
zpe.sumelectthermalent: -1257.125815 hartree
zpe.sumelectthermalfe: -1257.204524 hartree
dipole: 1.1037 2.3014 2.1354
dipole: 3.3278
quadrupole: -116.7697 -105.2143 -133.6263
quadrupole: 12.5682 -13.0006 -7.9979
quadrupole: 1.7671 13.3224 -15.0895 12.5682 -13.0006 -7.9979
hfenergy: -1257.4813368 hartree
pointgroup: C01 [X(C14H21N3O2S1)]
dipole: -0.3829413 -0.947674 0.8181956 debye
polarizability: 306.0075063|35.4604103|238.1335118|10.2007698|18.9312081|142.607561 unknown
InChI: InChI=1S/C14H21N3O2S/c1-15-20(18,19)10-11-4-5-14-13(8-11)12(9-16-14)6-7-17(2)3/h4-5,8-9,15-16H,6-7,10H2,1-3H3
charge 0 multiplicity 1
41 atoms
S  3.147466 1.073362 -0.207693
O  3.933526 0.212486 -1.351087
O  1.928168 2.090463 -0.595052
N  -1.784526 -3.325152 -0.614913
N  -3.880041 2.274058 -0.023916
N  4.448581 2.084891 0.756344
C  -2.386448 -1.276951 0.222874
C  -0.941434 -1.426577 0.324753
C  -3.196278 -0.0697 0.62491
C  -0.595069 -2.720353 -0.212763
C  1.430035 -1.045284 0.773361
C  -3.021737 1.114645 -0.365644
C  0.087114 -0.594511 0.820382
C  -2.859634 -2.45382 -0.353416
C  2.517279 -0.177139 1.266494
C  0.740651 -3.180837 -0.27528
C  1.743904 -2.330093 0.21447
C  -4.021586 3.207926 -1.162368
C  -3.441956 2.979365 1.19892
C  5.773808 2.101849 0.079522
H  -4.27278 -0.316122 0.66858
H  -2.899996 0.251057 1.642771
H  -3.311789 0.763466 -1.373631
H  -1.939837 1.399699 -0.423678
H  -0.140721 0.398747 1.223255
H  -3.88188 -2.738276 -0.596709
H  3.468678 -0.671664 1.507883
H  2.237642 0.572087 2.021204
H  -1.865215 -4.248351 -1.035185
H  0.992722 -4.160008 -0.696116
H  2.792653 -2.642806 0.163164
H  -4.424519 2.668494 -2.037988
H  -3.057684 3.689499 -1.466183
H  -4.734446 4.009845 -0.897574
H  -4.134719 3.813576 1.409888
H  -2.406875 3.40015 1.112811
H  -3.465342 2.299389 2.067666
H  4.011831 3.026396 0.808211
H  5.837692 2.776058 -0.796918
H  6.01409 1.080648 -0.261187
H  6.524071 2.403788 0.833038
