program: Gaussian 09
title: 000043745
version: EM64L-G09RevD.01
frameworkgroup: C1[X(C13H17N3O4)]
method: RPBEPBE
basis: SDD
operation: Freq
keyword: #p
keyword: freq=noraman
keyword: PBEPBE/SDD
title: #p freq=noraman PBEPBE/SDD
converged: YES YES NO NO
title: Mulliken charges:
elementType: O O O O N N N C C C C C C C C C C C C C H H H H H H H H H H H H H H H H H
charge: -0.245621 -0.255221 -0.203608 -0.205213 -0.103507 0.011382 0.021365 -0.338580 -0.349759 -0.356616 -0.317782 -0.313977 -0.275396 0.461117 -0.345691 -0.500334 -0.370253 0.386399 -0.180416 -0.359432 0.196989 0.203715 0.214064 0.195174 0.201168 0.221763 0.193650 0.216554 0.216321 0.194130 0.228210 0.214256 0.251316 0.286428 0.275859 0.289500 0.242045
chargesum: 0.00000
title: Mulliken charges with hydrogens summed into heavy atoms:
elementType: O O O O N N N C C C C C C C C C C C C C
charge: -0.245621 -0.255221 -0.203608 -0.205213 -0.103507 0.011382 0.021365 0.062124 0.059479 0.066315 0.092423 0.096474 0.167070 0.461117 -0.094376 -0.213906 -0.094393 0.386399 0.061629 -0.069932
polarizability: 3.22241381e+02 -4.52205182e+00 1.74148110e+02 -4.09807128e+00 -5.81865566e+00 1.02853369e+02
1716.lowfreq: -18.3723 -5.5065 -0.0006 0.0009 0.0009 5.8165 11.0824 13.1661 30.0023
frequency: -6.8467 11.1953 29.6760 50.6096 58.7222 67.1123 89.8381 131.6718 148.1500 156.7191 172.1989 187.6378 217.1481 236.5260 283.4877 303.7480 317.4470 347.0979 368.7787 391.4560 405.9613 424.6817 467.2907 472.1523 498.3202 534.3626 546.5969 598.4917 636.0484 671.3373 686.1363 703.6206 759.8539 779.9478 801.0761 811.5059 824.1530 841.8059 895.2804 902.5531 915.0243 915.9908 955.9677 960.8354 986.4455 990.8488 1002.3229 1006.4525 1028.2621 1051.2199 1061.1920 1079.1809 1084.2194 1091.1499 1092.3816 1111.1779 1137.7093 1150.4816 1174.4645 1191.2640 1201.2062 1209.2971 1232.0324 1249.1099 1269.3544 1286.7591 1294.8150 1298.3348 1311.6463 1331.3300 1337.4115 1348.7224 1365.9321 1371.2731 1372.2071 1391.8150 1398.9015 1434.2315 1444.1254 1449.1204 1451.9803 1460.9887 1474.6214 1478.6273 1486.8713 1552.8747 1586.4332 1616.8078 2864.8494 2871.9030 2894.4576 2955.3700 2959.2782 3004.5558 3029.8564 3037.9843 3039.1291 3070.3851 3080.1285 3081.5676 3084.9159 3149.7857 3166.9835 3170.0590 3188.6826
redmass: 3.5537 6.5374 5.5313 6.4986 2.9137 6.1523 3.7910 5.1604 5.9337 5.0880 5.2328 4.0414 4.2235 1.8596 4.4912 4.4211 2.4228 7.6436 4.3417 2.8842 3.2590 3.2442 2.8740 6.0920 5.9327 4.8562 4.9570 2.1009 5.5349 8.1538 2.2681 5.5088 4.4079 6.4511 1.4683 2.2969 1.4549 1.5925 2.7599 3.3218 1.4772 6.6836 1.3867 1.5650 6.1645 6.6721 2.7910 1.3637 2.1814 2.5582 1.9039 2.3455 1.7840 1.7756 3.0786 2.2940 2.4963 1.7654 1.1456 1.0806 1.3630 3.7214 2.6437 1.3069 1.2582 1.2276 1.2905 1.3537 1.3815 1.4224 1.4652 1.3475 1.4807 2.4333 2.0434 3.1684 1.7915 3.8304 1.0822 1.0807 1.0970 1.0989 1.0800 2.8191 1.0855 6.4021 6.5839 7.0025 1.0706 1.0694 1.0693 1.0665 1.0665 1.0571 1.0900 1.0894 1.0894 1.0899 1.1086 1.0962 1.0980 1.0879 1.0922 1.0947 1.0966
irintensity: 0.4005 1.0250 1.0231 0.0178 0.1514 0.3950 1.7076 4.7026 1.5667 2.8061 3.2748 7.9404 2.9765 1.8233 6.9782 0.9949 14.0232 0.4558 2.4390 0.5511 1.9150 0.5436 2.8969 2.5538 22.0467 8.6404 34.0482 10.8813 9.7926 50.7957 26.2989 18.6279 10.3861 8.4119 7.2385 25.7975 31.8915 0.2139 5.3488 25.0389 10.1862 175.2257 3.8688 46.1477 39.6256 281.9987 7.2908 1.8141 9.7275 24.1548 6.6484 2.8862 11.4196 32.4044 53.7571 2.1510 72.5539 1.9630 18.4216 1.2984 2.9205 218.5905 80.9804 15.5083 4.6908 18.3322 3.0767 0.9061 23.0192 1.3401 4.4632 4.3996 6.6238 50.4476 58.1770 6.4258 2.4097 14.4937 2.5807 1.3591 18.4748 7.0602 12.8035 24.3469 21.1432 35.4286 4.3041 4.4417 48.8778 86.4696 109.5849 28.3395 105.5915 54.2223 33.8429 44.2326 17.5798 10.2872 40.9255 44.1409 38.5291 6.4172 2.7694 6.1721 4.5984
temp: 298.150 k
press: 1.00000 atm
elementType: 8 8 8 8 7 7 7 6 6 6 6 6 6 6 6 6 6 6 6 6 1 1 1 1 1 1 1 1 1 1 1 1 1 1 1 1 1
symmnumber: 1
zpe: 766649.0 jmol-1
zpe.correction: 0.292001 hartree
zpe.thermalcorrener: 0.310110 hartree
zpe.thermalcorrenthalpy: 0.311054 hartree
zpe.thermalcorrgfe: 0.242897 hartree
zpe.sumelectzpe: -969.052691 hartree
zpe.sumelectthermal: -969.034583 hartree
zpe.sumelectthermalent: -969.033639 hartree
zpe.sumelectthermalfe: -969.101796 hartree
dipole: 3.4760 2.0824 -0.6328
dipole: 4.1011
quadrupole: -172.8300 -110.2851 -116.9001
quadrupole: -20.0707 -0.5601 1.8922
quadrupole: -39.4916 23.0533 16.4383 -20.0707 -0.5601 1.8922
hfenergy: -969.3446925 hartree
pointgroup: C01 [X(C13H17N3O4)]
dipole: -1.3647307 0.8170981 0.2707316 debye
polarizability: 322.3266367|3.8032741|173.5783975|-2.5792129|8.4624362|103.3378253 unknown
InChI: InChI=1S/C13H17N3O4/c17-16(18)13-3-1-2-12(10-13)11-14-20-9-6-15-4-7-19-8-5-15/h1-3,10-11H,4-9H2
charge 0 multiplicity 1
37 atoms
O  -7.519803 0.415049 -0.283656
O  -1.021536 -0.740465 -0.064654
O  7.344496 -0.192278 -0.021724
O  6.07485 -2.049401 -0.396423
N  -4.724088 -0.272131 0.127534
N  0.118901 0.1358 0.116189
N  6.206537 -0.790793 -0.137987
C  -5.143445 0.640551 -0.970144
C  -5.81124 -1.242035 0.425257
C  -3.420462 -0.929538 -0.123663
C  -6.439386 1.3698 -0.579312
C  -7.096109 -0.486364 0.801328
C  -2.263146 0.034526 0.175131
C  2.538028 0.140015 0.079337
C  1.238946 -0.536554 -0.049279
C  3.722555 -0.621314 -0.086356
C  2.645539 1.534196 0.364246
C  4.97173 0.018778 0.036034
C  3.907871 2.147393 0.480181
C  5.093477 1.395645 0.317329
H  -5.31344 0.074838 -1.921171
H  -4.351159 1.388638 -1.156897
H  -5.500888 -1.880914 1.2735
H  -6.0232 -1.906142 -0.450254
H  -3.32741 -1.315448 -1.167831
H  -3.330087 -1.798252 0.554005
H  -6.251182 2.010295 0.309264
H  -6.812613 1.989186 -1.411543
H  -7.937376 -1.182599 0.952674
H  -6.922681 0.100421 1.729113
H  -2.296814 0.368769 1.227146
H  -2.26188 0.918062 -0.488826
H  1.22728 -1.612929 -0.28323
H  3.690601 -1.692838 -0.306162
H  1.726722 2.115326 0.490127
H  6.085806 1.845528 0.402294
H  3.974909 3.217979 0.698421
