program: Gaussian 09
title: 000043715
version: EM64L-G09RevD.01
frameworkgroup: C1[X(C12H14O3)]
method: RPBEPBE
basis: SDD
operation: Freq
keyword: #pfreq=noraman
keyword: PBEPBE/SDD
title: #p freq=noraman PBEPBE/SDD
converged: YES YES NO NO
title: Mulliken charges:
elementType: O O O C C C C C C C C C C C C H H H H H H H H H H H H H H
charge: -0.266964 -0.263376 -0.255514 -0.287156 0.527992 -0.399896 -0.378370 0.318761 -0.348103 -0.355661 -0.037476 0.307627 -0.579552 -0.753456 -0.537908 0.241633 0.245358 0.232909 0.251493 0.239051 0.229490 0.218272 0.221789 0.248330 0.247378 0.243983 0.221411 0.221444 0.246511
chargesum: 0.00000
title: Mulliken charges with hydrogens summed into heavy atoms:
elementType: O O O C C C C C C C C C C C C
charge: -0.266964 -0.263376 -0.255514 -0.045523 0.527992 -0.154538 -0.145460 0.318761 -0.096610 -0.116610 0.192014 0.307627 -0.139491 -0.013765 0.151457
polarizability: 1.84054819e+02 -1.76245880e+01 1.20328837e+02 -6.84753262e+00 -2.27858327e+00 1.25629169e+02
1716.lowfreq: -12.3795 -8.4215 -6.6395 -0.0006 -0.0005 0.0004 14.6741 32.2364 47.0684
frequency: 14.6588 32.2202 47.0334 56.1311 72.6227 87.8259 115.5578 135.7801 182.2396 201.3232 239.7689 260.6973 272.3422 311.3592 371.3340 400.2413 412.4773 432.2584 487.6084 531.6853 549.6548 566.3374 610.8805 629.1968 649.0042 736.1250 757.4242 809.0766 822.4638 833.6622 852.7507 882.2385 933.2104 951.9270 957.4615 964.2693 987.6340 992.3641 994.5270 1003.3149 1041.6371 1106.8613 1112.2992 1153.1109 1160.1839 1178.9709 1198.3878 1215.1484 1233.9118 1263.7761 1286.9452 1292.1430 1321.4743 1380.2102 1392.9021 1419.2232 1435.7767 1436.8525 1453.2368 1455.5296 1467.0595 1472.1030 1501.9918 1585.0721 1620.9679 1641.8368 1659.2512 2959.5471 3005.9401 3046.3271 3047.6712 3091.1555 3099.0175 3115.9593 3125.4704 3133.9218 3140.2229 3141.5213 3163.4675 3170.5475 3200.9074
redmass: 3.7055 6.6667 2.9985 1.5352 1.9503 3.0191 3.8602 3.7183 4.3689 1.8005 1.4446 3.7313 4.1551 3.9290 3.2111 3.9821 2.9223 3.5923 3.6935 2.6558 3.8673 3.6087 4.3234 5.5429 2.4698 3.7909 4.3808 1.4501 2.0781 3.0734 2.6856 7.4593 1.4187 1.5687 1.3826 1.3964 6.7185 1.7790 1.2282 2.5097 1.6492 1.4654 1.2602 1.7318 1.5905 1.3103 2.9305 1.9891 3.6282 1.4664 1.4081 1.2669 1.4617 1.2440 3.6013 2.5430 1.2958 1.2003 1.0594 1.0524 1.0503 1.0737 2.4853 6.9611 6.3455 9.2315 4.7969 1.0330 1.0374 1.0862 1.1040 1.0604 1.0954 1.0941 1.0992 1.0886 1.1020 1.0890 1.0945 1.0962 1.1145
irintensity: 0.2861 0.6144 1.7567 1.2711 1.8829 2.6644 0.5904 4.8164 6.9848 3.0002 2.4266 1.4219 3.0045 0.7354 2.1471 6.2871 0.4860 6.6558 4.2029 22.8612 10.1949 12.3100 17.3088 3.1024 11.7395 2.1777 1.4652 42.8533 72.5362 9.6188 19.7475 151.7540 2.6442 81.0632 53.5320 5.3129 51.6380 44.8289 3.9723 3.1614 7.9245 11.8067 0.1871 12.1578 28.5123 100.3544 289.9297 12.4008 187.9442 21.3174 11.0354 4.1680 6.9130 52.0797 5.3310 1.7479 11.3239 11.5056 22.1081 21.3915 13.4983 50.6881 79.4711 8.3914 95.8674 163.0343 10.8675 67.6615 3.2692 7.9404 48.7515 9.5389 9.7132 4.9292 28.1695 8.8523 9.8629 7.7760 14.6587 3.7970 20.8358
temp: 298.150 k
press: 1.00000 atm
elementType: 8 8 8 6 6 6 6 6 6 6 6 6 6 6 6 1 1 1 1 1 1 1 1 1 1 1 1 1 1
symmnumber: 1
zpe: 604576.1 jmol-1
zpe.correction: 0.230271 hartree
zpe.thermalcorrener: 0.246080 hartree
zpe.thermalcorrenthalpy: 0.247024 hartree
zpe.thermalcorrgfe: 0.184311 hartree
zpe.sumelectzpe: -690.200998 hartree
zpe.sumelectthermal: -690.185189 hartree
zpe.sumelectthermalent: -690.184245 hartree
zpe.sumelectthermalfe: -690.246958 hartree
dipole: 1.4747 0.7712 -3.1814
dipole: 3.5903
quadrupole: -77.8956 -86.5800 -85.0634
quadrupole: -2.3573 -3.9875 4.5569
quadrupole: 5.2840 -3.4003 -1.8837 -2.3573 -3.9875 4.5569
hfenergy: -690.4312692 hartree
pointgroup: C01 [X(C12H14O3)]
dipole: 0.4948136 0.0512417 1.3220522 debye
polarizability: 185.5327779|15.0884499|117.5762925|5.2964803|0.5999184|126.9037551 unknown
InChI: InChI=1S/C12H14O3/c1-4-12(15-9(2)13)10-5-7-11(14-3)8-6-10/h4-8,12H,1H2,2-3H3
charge 0 multiplicity 1
29 atoms
O  -2.32078 0.654936 0.402087
O  4.062274 0.111894 -0.243722
O  -2.447153 1.320548 -1.836244
C  -1.643062 -0.642758 -0.033023
C  -0.138578 -0.432773 -0.044472
C  0.579154 -0.510632 -1.266279
C  0.578332 -0.155047 1.144631
C  2.676893 -0.054994 -0.101462
C  1.972693 -0.329203 -1.300702
C  1.976474 0.038746 1.128226
C  -2.122133 -1.685611 0.946965
C  -2.639955 1.555502 -0.621243
C  -2.843438 -2.774595 0.586697
C  -3.221708 2.827297 -0.040001
C  4.838048 0.411823 0.962321
H  -2.00005 -0.868157 -1.053572
H  0.036548 -0.700241 -2.199031
H  0.042333 -0.068731 2.096669
H  2.534618 -0.385556 -2.237678
H  2.501545 0.258265 2.062581
H  -1.84348 -1.532841 1.998383
H  -3.157205 -3.523169 1.322369
H  -3.137384 -2.95284 -0.455165
H  -2.403478 3.455164 0.357394
H  -3.904355 2.599646 0.794245
H  -3.74785 3.387167 -0.827214
H  4.761138 -0.405661 1.70553
H  4.513365 1.364983 1.423328
H  5.878694 0.502437 0.618279
