program: Gaussian 09
title: 000043782
version: EM64L-G09RevD.01
frameworkgroup: C1[X(C12H22N2O4S)]
method: RPBEPBE
basis: SDD
operation: Freq
keyword: #p
keyword: freq=noraman
keyword: PBEPBE/SDD
title: #p freq=noraman PBEPBE/SDD
converged: YES YES NO NO
title: Mulliken charges:
elementType: S O O O O N N C C C C C C C C C C C C H H H H H H H H H H H H H H H H H H H H H H
charge: 0.072332 -0.235402 -0.439849 -0.204748 -0.278220 -0.078551 -0.386503 -0.361632 -0.383400 -0.345023 -0.334633 -0.020119 -0.113187 -0.655460 -0.679560 -0.675950 0.164084 0.258960 -0.772579 0.202925 0.248596 0.237347 0.215754 0.190810 0.243038 0.231675 0.198688 0.301980 0.334355 0.307990 0.220319 0.204520 0.223695 0.215496 0.206609 0.226183 0.347037 0.214316 0.253931 0.253922 0.390256
chargesum: 0.00000
title: Mulliken charges with hydrogens summed into heavy atoms:
elementType: S O O O O N N C C C C C C C C C C C C
charge: 0.072332 -0.235402 -0.049593 -0.204748 -0.278220 -0.078551 -0.039466 0.089889 0.069701 0.088824 0.095730 -0.020119 0.188793 -0.013115 -0.031027 -0.027662 0.164084 0.258960 -0.050410
polarizability: 2.20225958e+02 -1.48341505e+01 1.69397331e+02 1.04840047e+01 1.09944669e+01 1.45109622e+02
1716.lowfreq: -0.0012 0.0006 0.0018 2.9862 5.9372 9.6981 17.5918 20.1962 31.7633
frequency: 17.1152 20.1501 31.7146 34.2464 43.8181 49.9667 58.4396 64.9979 73.5371 82.0658 88.4734 93.8274 108.9065 120.2555 162.6221 188.2380 213.2397 217.1761 238.3160 240.3179 269.9863 278.2464 312.4057 335.5954 351.7178 353.5977 402.3346 442.5048 467.6564 511.5186 522.9702 534.0661 569.3631 601.9015 614.3033 620.1335 623.2699 653.6930 687.9430 722.7707 746.9025 748.7988 818.8031 849.8689 868.5371 883.7521 889.7484 910.6639 933.4423 943.1082 975.5265 993.0364 1043.5932 1048.4234 1051.1349 1076.9366 1091.8737 1105.6986 1111.9408 1120.0466 1137.6369 1187.2968 1203.0285 1217.3787 1231.6812 1244.8006 1264.6843 1284.8428 1290.8122 1295.6130 1300.5849 1307.1003 1314.2782 1326.5537 1357.8300 1363.8230 1383.5625 1388.2142 1390.9560 1392.7212 1434.3449 1450.2747 1454.4053 1463.3076 1471.9451 1474.0912 1477.2778 1479.1140 1479.7257 1482.1629 1486.2364 1489.4348 1609.0034 1636.9489 1681.9933 2975.8483 2976.0812 2983.3458 2984.7728 2988.9874 2992.1550 2997.8908 3000.4201 3015.8109 3033.6584 3042.1015 3053.8804 3066.8330 3075.8442 3080.3689 3081.6058 3082.9716 3098.4558 3102.4216 3121.1754 3526.6241 3564.5047
redmass: 4.9631 5.1314 4.6766 3.3978 3.4779 4.2441 2.6033 1.8911 6.0002 1.6853 1.7170 3.7503 4.7413 7.9611 4.7674 5.1779 1.2324 1.2243 2.4549 2.7234 4.8817 3.0590 3.5223 3.1736 3.6661 3.7687 4.4227 3.5286 5.5335 3.8105 3.7152 3.7217 1.5522 2.2696 2.6880 4.7353 3.1048 2.8435 4.0044 4.6001 1.1199 1.1085 3.7684 1.9237 1.2561 1.4057 1.6999 2.3626 2.9564 5.0011 2.6543 1.5683 1.6525 3.0031 2.9092 1.7877 1.7558 2.1297 2.2282 1.9841 3.1095 1.2635 2.5501 1.6593 1.3439 1.4713 1.4007 1.2562 1.5899 1.2535 1.2936 1.2633 1.6404 1.6394 1.3685 1.3912 2.0376 1.2358 1.2089 1.2109 1.0818 1.0459 1.0837 1.1814 1.0739 1.0534 1.0656 1.0464 1.0618 1.7991 1.0809 1.0891 6.4171 8.5329 9.3347 1.0362 1.0362 1.0612 1.0625 1.0809 1.0624 1.0359 1.0622 1.0626 1.0977 1.0961 1.1026 1.1010 1.1023 1.0995 1.0990 1.1036 1.0983 1.1005 1.1030 1.0643 1.0785
irintensity: 0.6323 0.1009 0.3419 1.7863 4.8381 2.4183 0.4616 5.9246 0.8430 0.3624 0.5221 3.1960 2.3947 1.3366 11.9919 0.8986 0.3713 0.0692 1.6146 0.4253 4.5069 8.5161 1.5118 14.0414 8.6845 1.8040 3.4860 11.4025 7.6647 27.9632 72.9091 6.7950 44.0386 95.0387 31.4221 8.2220 106.4996 38.1486 39.7212 6.9914 2.7039 21.7007 8.4186 12.2729 2.2241 15.5354 17.8039 19.6801 21.5660 30.7988 68.7062 4.2945 15.3601 0.2982 0.7777 150.6131 58.4970 25.7505 1.8805 134.1859 22.7379 15.1031 47.3177 60.4430 4.1263 18.6384 19.0897 50.9309 28.7348 4.0777 0.3013 9.4372 24.2007 10.5670 1.6116 8.0338 120.0252 54.4640 16.0631 14.8745 34.9782 16.2370 13.7026 123.7695 3.1819 5.2704 13.2911 14.2922 0.4541 234.4715 20.0183 18.4800 169.0185 229.8509 213.5902 45.0278 26.2750 5.1638 11.2618 12.9946 55.1382 10.2102 41.9449 14.2492 2.0065 1.9727 3.5534 12.0484 70.9355 39.1417 39.4897 61.6168 10.0845 18.1411 4.6040 28.0157 49.2603
temp: 298.150 k
press: 1.00000 atm
elementType: 16 8 8 8 8 7 7 6 6 6 6 6 6 6 6 6 6 6 6 1 1 1 1 1 1 1 1 1 1 1 1 1 1 1 1 1 1 1 1 1 1
symmnumber: 1
zpe: 882453.2 jmol-1
zpe.correction: 0.336109 hartree
zpe.thermalcorrener: 0.359797 hartree
zpe.thermalcorrenthalpy: 0.360741 hartree
zpe.thermalcorrgfe: 0.278183 hartree
zpe.sumelectzpe: -1277.459741 hartree
zpe.sumelectthermal: -1277.436053 hartree
zpe.sumelectthermalent: -1277.435108 hartree
zpe.sumelectthermalfe: -1277.517667 hartree
dipole: 3.1579 2.9485 5.4925
dipole: 6.9880
quadrupole: -114.3239 -125.0990 -121.7713
quadrupole: 0.5454 -12.0587 -3.5375
quadrupole: 6.0742 -4.7009 -1.3732 0.5454 -12.0587 -3.5375
hfenergy: -1277.7958497 hartree
pointgroup: C01 [X(C12H22N2O4S1)]
dipole: 1.1522789 1.3486948 2.1004706 debye
polarizability: 218.203113|-14.9571186|171.8170379|16.1610205|7.3537795|144.7127601 unknown
InChI: InChI=1S/C12H22N2O4S/c1-4-6-14(7-5-2)12(18)19-8-10(11(16)17)13-9(3)15/h10,13,16H,4-8H2,1-3H3
charge 0 multiplicity 1
41 atoms
S  -0.102126 0.795652 -0.5535
O  1.455819 -1.325188 -1.448307
O  -2.085389 -1.045562 2.039985
O  -1.194684 -2.716237 0.693064
O  -4.474658 0.286248 -1.884051
N  2.612179 0.315735 -0.257625
N  -3.26646 0.247689 0.092571
C  3.89778 -0.411292 -0.438382
C  2.635548 1.587718 0.498601
C  4.151652 -1.458653 0.670163
C  2.932835 2.822733 -0.384799
C  1.483119 -0.241314 -0.807915
C  -2.42485 -0.863018 -0.367067
C  -1.308632 -0.418104 -1.347482
C  5.508272 -2.169808 0.480051
C  3.00424 4.117603 0.451945
C  -1.835436 -1.653942 0.797617
C  -4.267917 0.752291 -0.719705
C  -5.092377 1.890585 -0.130256
H  4.710277 0.340183 -0.453581
H  3.874944 -0.912902 -1.421776
H  1.669295 1.721767 1.019367
H  3.410882 1.494856 1.284012
H  4.120419 -0.963539 1.661277
H  3.328767 -2.196414 0.648448
H  2.14291 2.909603 -1.154019
H  3.889271 2.666714 -0.921731
H  -3.067404 -1.555711 -0.949588
H  -0.696448 -1.276111 -1.681337
H  -1.774872 0.081939 -2.208863
H  5.548336 -2.69432 -0.492706
H  6.349373 -1.451203 0.512429
H  5.676221 -2.920636 1.272553
H  2.048161 4.307931 0.974654
H  3.802653 4.060964 1.216139
H  3.214913 4.991378 -0.1898
H  -3.117373 0.595903 1.04081
H  -4.806557 2.151152 0.903266
H  -4.981294 2.784801 -0.767678
H  -6.158912 1.607996 -0.147978
H  -1.666579 -1.586684 2.761995
