program: Gaussian 09
title: 000043697
version: EM64L-G09RevD.01
frameworkgroup: C1[X(C11H25NO6S2)]
method: RPBEPBE
basis: SDD
operation: Freq
keyword: #p
keyword: freq=noraman
keyword: PBEPBE/SDD
title: #p freq=noraman PBEPBE/SDD
converged: YES YES NO NO
title: Mulliken charges:
elementType: S S O O O O O O N C C C C C C C C C C C H H H H H H H H H H H H H H H H H H H H H H H H H
charge: 1.054252 1.053520 -0.418225 -0.417047 -0.518054 -0.518955 -0.518242 -0.518481 -0.275366 -0.362986 -0.391727 -0.373269 -0.375028 -0.381899 -0.353704 -0.395209 -0.274742 -0.255507 -0.731425 -0.731407 0.192768 0.193774 0.220221 0.182106 0.199308 0.195578 0.179714 0.210556 0.217381 0.216968 0.240036 0.209466 0.178602 0.239890 0.205105 0.228687 0.226863 0.222740 0.225188 0.288549 0.281378 0.288739 0.289500 0.281432 0.288954
chargesum: 0.00000
title: Mulliken charges with hydrogens summed into heavy atoms:
elementType: S S O O O O O O N C C C C C C C C C C C
charge: 1.054252 1.053520 -0.418225 -0.417047 -0.518054 -0.518955 -0.518242 -0.518481 -0.035330 0.023556 0.010600 0.021617 0.015242 0.052450 0.034364 0.049786 0.180807 0.192421 0.127241 0.128479
polarizability: 3.20189316e+02 -4.30013696e+00 1.73069703e+02 3.19401328e-01 8.44329140e-01 1.68226873e+02
1716.lowfreq: -3.7423 -2.9264 -0.0027 -0.0025 -0.0023 1.9051 5.4208 10.0953 15.3184
frequency: 2.5411 3.4485 13.7544 15.5705 20.1706 39.4852 43.4696 53.8962 64.3612 78.3648 90.4757 90.8562 94.8426 121.7634 124.4698 131.8007 150.3198 152.3056 155.5694 157.4182 165.3663 183.1794 216.8520 218.4954 226.9868 256.6551 288.2931 295.7598 297.3508 335.7523 339.7032 358.1176 385.6216 398.7458 431.4031 469.9605 505.1577 563.1214 569.8277 602.3957 603.7215 678.2858 735.0797 760.0676 783.0568 809.3395 837.2178 837.2718 880.8128 891.9936 911.2581 911.6686 914.7343 921.6767 983.2822 992.0250 996.3667 998.2872 1008.0489 1034.9822 1038.3688 1038.8833 1046.6185 1070.3339 1076.3132 1078.9802 1095.8660 1108.4144 1148.2133 1150.3220 1156.7537 1197.2706 1222.7748 1229.7912 1258.4940 1265.3981 1270.7815 1277.6252 1278.8225 1287.2149 1292.6347 1295.2606 1314.9965 1316.0515 1326.0505 1349.4887 1358.0396 1363.6790 1365.2471 1393.6904 1415.5754 1416.0278 1418.8180 1419.0618 1457.0701 1465.6706 1467.4792 1470.3922 1472.0278 1480.8911 1484.5022 1490.2932 1492.9980 1500.0317 2841.5543 2849.8631 2957.7225 2961.0754 2969.4170 2977.0854 2978.0992 2994.1445 2996.0379 2998.1054 2999.6314 3006.8219 3021.2647 3038.1096 3040.4671 3041.9073 3042.0059 3046.8651 3071.4046 3081.1985 3190.6156 3190.8595 3198.6703 3198.8343 3422.3828
redmass: 6.8932 7.4998 6.6968 5.9020 6.4599 2.6530 5.1233 2.8676 1.9522 4.9990 2.5573 9.2143 2.1031 2.9656 2.0993 2.7592 1.8937 1.0671 1.0597 2.2956 5.1373 3.7110 4.7490 4.6907 4.4094 4.9161 5.1918 7.6746 7.6853 7.4772 6.3577 8.6326 5.3810 5.7764 4.2773 3.9230 3.6700 7.4066 6.3970 8.9487 9.0020 1.3089 1.0687 1.0963 1.0776 1.1515 11.2866 11.2467 1.1990 1.2528 2.8103 2.8208 6.7710 6.0428 1.4106 1.8439 1.4359 2.5743 2.5158 3.5341 2.0014 1.9751 3.2575 2.7178 3.1368 2.2651 1.8180 2.2500 3.2385 1.5593 1.2635 1.5074 1.3322 1.3219 1.2516 1.1856 1.1865 1.1069 1.0947 1.1740 1.2029 1.1169 1.1342 1.1348 1.3026 1.3505 1.5760 1.3304 1.4037 1.4689 1.0518 1.0517 1.0505 1.0504 1.2070 1.0747 1.0655 1.0761 1.0810 1.0906 1.0862 1.0913 1.0955 1.0849 1.0715 1.0712 1.0616 1.0612 1.0604 1.0548 1.0550 1.0838 1.0763 1.0600 1.0960 1.0723 1.1011 1.1058 1.1060 1.0248 1.0248 1.1041 1.1072 1.1035 1.1078 1.1078 1.1076 1.1076 1.0740
irintensity: 0.6058 0.1301 9.3253 3.0454 0.1942 1.0608 0.1376 1.3380 4.6784 13.9390 0.7375 0.3891 0.1513 1.7957 1.4023 0.6266 5.0145 0.5050 0.2194 2.7206 7.5986 1.9805 2.1498 1.8661 0.4770 0.1480 10.4409 10.2046 10.3577 7.7071 49.0426 35.5701 3.2443 0.2005 16.4936 51.4554 5.1183 3.6642 71.1521 107.3290 37.5325 86.0310 12.3902 0.4030 4.6420 2.4155 132.9671 1.9611 0.2630 3.9220 25.7857 39.6493 105.3271 74.9405 1.2934 3.7765 87.5527 12.7075 1.6141 3.8150 64.5609 76.5590 7.5676 1.0948 7.7266 1.0619 20.3168 22.8951 70.7814 8.5173 3.8993 3.5658 0.9775 35.2172 4.5265 0.6092 0.0020 1.4531 1.7634 0.8814 2.0170 0.2485 3.4945 4.2566 6.1433 14.3559 0.0211 0.1784 46.0359 1.3738 12.9118 12.9230 12.0517 11.8368 37.8922 2.7787 0.7989 2.7468 1.5993 18.7075 5.8577 20.0387 4.9997 9.9630 39.0079 175.4338 2.0611 6.8093 56.0915 32.0519 36.0983 24.3867 9.9051 46.6790 5.0178 51.2379 3.1400 10.7613 9.9302 0.0391 0.0539 61.2564 88.5250 43.1252 0.1312 0.1193 0.0039 0.0010 1.4745
temp: 298.150 k
press: 1.00000 atm
elementType: 16 16 8 8 8 8 8 8 7 6 6 6 6 6 6 6 6 6 6 6 1 1 1 1 1 1 1 1 1 1 1 1 1 1 1 1 1 1 1 1 1 1 1 1 1
symmnumber: 1
zpe: 953664.0 jmol-1
zpe.correction: 0.363231 hartree
zpe.thermalcorrener: 0.391074 hartree
zpe.thermalcorrenthalpy: 0.392018 hartree
zpe.thermalcorrgfe: 0.293963 hartree
zpe.sumelectzpe: -1734.353222 hartree
zpe.sumelectthermal: -1734.325380 hartree
zpe.sumelectthermalent: -1734.324436 hartree
zpe.sumelectthermalfe: -1734.422491 hartree
dipole: 0.4654 -0.6178 0.1742
dipole: 0.7929
quadrupole: -157.5009 -138.2895 -148.8261
quadrupole: -68.1370 -2.8503 1.4907
quadrupole: -9.2954 9.9160 -0.6206 -68.1370 -2.8503 1.4907
hfenergy: -1734.7164538 hartree
pointgroup: C01 [X(C11H25N1O6S2)]
dipole: -0.1833408 -0.241674 -0.0727223 debye
polarizability: 320.1960212|4.1873025|173.092369|0.2528634|-0.7610531|168.1975011 unknown
InChI: InChI=1S/C11H25NO6S2/c1-19(13,14)17-10-6-4-3-5-8-12-9-7-11-18-20(2,15)16/h12H,3-11H2,1-2H3
charge 0 multiplicity 1
45 atoms
S  -8.488918 0.357823 0.016576
S  8.510812 0.011205 0.015252
O  -6.848933 -0.536942 0.064705
O  6.766288 0.687653 0.048253
O  -8.711572 1.016841 -1.446039
O  -8.652616 1.276053 1.341011
O  8.829507 -0.612204 -1.445406
O  8.778447 -0.880429 1.340882
N  1.922234 0.166496 -0.122768
C  -1.873382 -0.599874 -0.039339
C  -0.56496 0.220662 -0.078872
C  -3.135883 0.291397 -0.040243
C  0.697721 -0.662821 -0.08194
C  -4.444719 -0.534253 0.01015
C  3.190932 -0.587666 -0.099641
C  4.38951 0.385656 -0.032193
C  -5.680143 0.376354 -0.004334
C  5.72656 -0.367689 -0.030167
C  -9.496514 -1.239072 0.185103
C  9.299991 1.725797 0.19303
H  -1.908361 -1.286351 -0.91059
H  -1.878286 -1.241541 0.865997
H  -0.515039 0.902647 0.791867
H  -0.565376 0.863427 -0.9853
H  -3.097504 0.98053 0.828099
H  -3.133013 0.92869 -0.9485
H  0.637531 -1.389916 -0.932842
H  0.726072 -1.266792 0.847306
H  -4.463249 -1.155707 0.925597
H  -4.491709 -1.222335 -0.855178
H  1.895965 0.831795 -0.909398
H  3.186278 -1.232948 0.801392
H  3.312546 -1.270087 -0.980576
H  4.302356 1.001653 0.879828
H  4.366667 1.072489 -0.900841
H  -5.685548 1.054816 0.870759
H  -5.724551 0.970187 -0.93823
H  5.858331 -0.953887 -0.960891
H  5.807795 -1.037847 0.847704
H  -9.192746 -1.688425 1.138944
H  -10.551511 -0.932985 0.175285
H  -9.225727 -1.85952 -0.678532
H  8.932949 2.130137 1.144778
H  10.385907 1.559966 0.190903
H  8.956862 2.307117 -0.672099
