program: Gaussian 09
title: 000043714
version: EM64L-G09RevD.01
frameworkgroup: C1[X(C12H14N2S)]
method: RPBEPBE
basis: SDD
operation: Freq
keyword: #p
keyword: freq=noraman
keyword: PBEPBE/SDD
title: #p freq=noraman PBEPBE/SDD
converged: YES YES NO NO
title: Mulliken charges:
elementType: S N N C C C C C C C C C C C C H H H H H H H H H H H H H H
charge: 0.206319 -0.122216 -0.046639 0.338391 0.150417 0.462480 -0.566511 -0.364227 -0.188236 -0.401299 -0.824111 -0.815190 -0.024129 -0.599096 -0.524352 0.230463 0.242096 0.228039 0.233135 0.222024 0.243071 0.254730 0.222249 0.221294 0.232366 0.212636 0.255667 0.254098 0.266530
chargesum: 0.00000
title: Mulliken charges with hydrogens summed into heavy atoms:
elementType: S N N C C C C C C C C C C C C
charge: 0.206319 -0.122216 -0.046639 0.338391 0.150417 0.462480 -0.336049 -0.122132 -0.188236 -0.173260 -0.125880 -0.139281 0.230601 0.123306 -0.257822
polarizability: 2.44334437e+02 -2.93181110e+00 1.37722090e+02 5.18709623e+00 -3.76110387e+00 1.15382968e+02
1716.lowfreq: -8.4598 -0.0026 -0.0020 -0.0017 1.8961 5.8562 23.8779 31.5241 31.9290
frequency: 23.5459 31.3706 31.8181 48.8357 61.0536 113.1553 125.6187 131.8095 197.6604 206.7781 212.2568 277.1417 307.7113 339.1676 372.9493 426.4098 460.7811 472.1349 482.4488 508.4189 552.5233 563.3200 567.4666 587.4290 656.9634 661.0860 714.0375 730.0959 752.8945 810.4181 823.6885 830.1359 884.1280 913.0160 929.0431 949.8187 980.0485 1017.9580 1040.2814 1043.9307 1048.5510 1100.2851 1122.2829 1122.9817 1160.6524 1200.3297 1228.5291 1247.6277 1285.0987 1324.8721 1352.3646 1357.8351 1395.9794 1399.2356 1407.3032 1436.8885 1449.7174 1462.8419 1470.2331 1473.9079 1476.0878 1489.2262 1496.8517 1571.9113 1586.7356 1619.6328 1686.4542 2969.9578 2971.5127 2995.8761 3048.5154 3049.9408 3079.6801 3082.5445 3082.6729 3107.7313 3116.9388 3120.5799 3153.7233 3203.9412 3259.5512
redmass: 3.1074 1.0593 1.0885 4.7347 4.2740 1.2183 4.3196 3.1114 3.7743 2.9009 3.6942 2.5819 4.7619 4.0007 4.7752 3.2088 4.9561 4.6455 4.3302 5.0091 3.9208 4.7280 3.7183 4.2374 1.9300 3.2910 5.5736 3.3712 5.6456 4.9291 1.4648 1.2818 1.3011 3.7648 3.4411 1.3533 1.4873 1.5017 1.8233 1.5178 1.5470 1.1804 1.4271 1.5889 1.6153 2.4567 1.8095 2.2669 1.6767 2.8205 4.0995 6.2098 1.2271 1.2521 2.9958 1.2003 1.0435 1.0504 1.2259 1.0549 1.2881 1.1735 1.6988 6.2700 6.0923 6.4309 11.3004 1.0386 1.0377 1.0333 1.0960 1.0947 1.0995 1.1004 1.1003 1.0910 1.1022 1.0885 1.0958 1.0927 1.1020
irintensity: 0.1290 0.2136 0.4796 1.8141 3.1481 0.7391 0.4866 0.1168 2.4012 3.8288 1.5134 1.7945 2.8343 1.3717 11.0430 5.9221 15.7660 6.2056 1.2423 2.5150 36.6289 16.4866 2.1935 11.5758 45.2340 15.6294 2.2148 0.4862 15.7330 10.1457 47.7189 1.4778 4.9616 38.9366 3.6446 1.6547 3.3119 8.1486 8.9095 8.2382 15.4481 10.9409 2.1124 17.8755 6.0244 64.5357 24.4401 12.1203 1.1026 18.3834 41.9960 2.2284 6.0167 11.5686 2.6784 13.1164 15.0276 19.8814 6.1552 12.5585 21.3373 63.6631 30.6733 0.9973 39.1641 38.4200 946.6860 57.1821 25.3455 49.0945 13.2079 28.5482 18.4924 29.5140 9.0961 29.1965 17.4968 20.7095 15.2959 2.5895 3.1819
temp: 298.150 k
press: 1.00000 atm
elementType: 16 7 7 6 6 6 6 6 6 6 6 6 6 6 6 1 1 1 1 1 1 1 1 1 1 1 1 1 1
symmnumber: 1
zpe: 604454.7 jmol-1
zpe.correction: 0.230225 hartree
zpe.thermalcorrener: 0.246003 hartree
zpe.thermalcorrenthalpy: 0.246947 hartree
zpe.thermalcorrgfe: 0.184413 hartree
zpe.sumelectzpe: -972.136781 hartree
zpe.sumelectthermal: -972.121002 hartree
zpe.sumelectthermalent: -972.120058 hartree
zpe.sumelectthermalfe: -972.182593 hartree
dipole: 3.0088 0.3711 0.5626
dipole: 3.0833
quadrupole: -74.1994 -94.3109 -96.3352
quadrupole: 5.2667 2.1542 -1.6427
quadrupole: 14.0824 -6.0290 -8.0534 5.2667 2.1542 -1.6427
hfenergy: -972.3670054 hartree
pointgroup: C01 [X(C12H14N2S1)]
dipole: 1.192403 0.2217035 0.02382 debye
polarizability: 243.3511181|0.0835796|115.6179438|11.6521965|-4.8123559|138.4704331 unknown
InChI: InChI=1S/C12H14N2S/c1-9-4-5-11(10(2)8-9)13-12-14(3)6-7-15-12/h4-8H,1-3H3
charge 0 multiplicity 1
29 atoms
S  1.677292 -1.416917 1.378331
N  3.106734 0.161643 -0.24192
N  0.784034 0.39612 -0.68219
C  -1.281982 0.736697 0.665208
C  -0.6016 0.176783 -0.462869
C  -3.421916 -0.214741 -0.173787
C  -2.677492 0.526011 0.778268
C  -1.340564 -0.540607 -1.439304
C  1.753697 -0.132071 -0.010026
C  -2.728073 -0.73883 -1.293668
C  -0.53728 1.566482 1.694838
C  -4.912715 -0.447814 0.006285
C  4.033867 -0.534842 0.552916
C  3.467419 1.127657 -1.29098
C  3.492341 -1.400932 1.459901
H  -3.201192 0.960756 1.640178
H  -0.807315 -0.932761 -2.31165
H  -3.277191 -1.302005 -2.058255
H  0.133763 2.29647 1.20557
H  -1.241532 2.118405 2.340824
H  0.097245 0.937189 2.348416
H  5.096829 -0.345696 0.403557
H  -5.395657 0.396481 0.530288
H  -5.421092 -0.581289 -0.965225
H  -5.106619 -1.358996 0.605964
H  4.55653 1.292867 -1.270897
H  2.942367 2.082797 -1.120699
H  3.165559 0.749956 -2.283715
H  4.013746 -2.032912 2.17284
