program: Gaussian 09
title: 000043711
version: EM64L-G09RevD.01
frameworkgroup: C1[X(C12H5Cl5O2)]
method: RPBEPBE
basis: SDD
operation: Freq
keyword: #p
keyword: freq=noraman
keyword: PBEPBE/SDD
title: #p freq=noraman PBEPBE/SDD
converged: YES YES NO NO
title: Mulliken charges:
elementType: Cl Cl Cl Cl Cl O O C C C C C C C C C C C C H H H H H
charge: 0.007031 -0.000427 0.014038 0.005308 0.015345 -0.327722 -0.405937 0.243376 0.535040 0.116903 -0.281785 -0.361112 -0.296409 -0.295466 -0.091074 -0.081185 -0.176853 -0.077574 -0.111935 0.297586 0.307567 0.288907 0.287758 0.388620
chargesum: 0.00000
title: Mulliken charges with hydrogens summed into heavy atoms:
elementType: Cl Cl Cl Cl Cl O O C C C C C C C C C C C C
charge: 0.007031 -0.000427 0.014038 0.005308 0.015345 -0.327722 -0.017316 0.243376 0.535040 0.116903 0.015801 -0.361112 0.011158 -0.006559 -0.091074 -0.081185 0.110905 -0.077574 -0.111935
polarizability: 2.69651428e+02 -2.89006870e+00 2.00264605e+02 -1.22712328e+01 -5.02324602e+00 1.08244558e+02
1716.lowfreq: -3.7209 -0.0007 0.0017 0.0023 1.5030 4.2826 16.7703 19.0419 34.9684
frequency: 16.7246 19.0164 34.9587 66.8663 83.0219 130.6435 139.3514 152.9121 180.6954 182.6283 199.4073 215.2924 233.2311 252.6560 268.9980 312.7095 340.1193 358.8977 360.3336 388.9938 424.2497 439.0091 448.6822 488.4942 494.6703 501.2864 557.2952 594.3005 604.3136 623.9807 653.6204 663.1606 673.1977 682.5056 725.1088 797.7466 839.8663 853.4623 863.0468 876.1078 884.2227 919.2204 1036.0254 1099.5291 1111.5592 1123.5234 1170.6060 1222.3291 1230.8252 1238.7610 1276.4192 1329.3611 1365.2999 1378.7216 1395.2815 1446.7588 1469.6689 1562.1430 1582.2309 1589.5465 1607.7323 3172.3718 3175.9709 3182.2190 3188.7061 3519.5132
redmass: 13.3809 14.0194 20.6064 24.1781 15.4696 11.6668 15.0833 10.8776 28.8695 23.6142 8.1251 8.7173 7.6472 10.7633 7.8268 25.4057 12.7207 12.2797 14.4718 14.5270 6.0363 3.2906 3.6642 5.0324 1.4916 3.5685 5.4414 9.7968 9.6747 8.9766 7.7392 6.7245 3.9305 4.3782 7.4404 6.8631 1.4731 1.4557 1.4192 6.0034 1.4645 9.4052 6.3165 1.7356 1.8237 5.3534 1.5219 3.2362 1.4165 1.3685 4.9838 9.2972 9.5134 10.4534 3.5099 3.1407 3.9577 9.0728 8.1197 9.2903 7.2706 1.0927 1.0921 1.0932 1.0931 1.0649
irintensity: 0.4923 0.0436 0.1342 0.1480 0.2915 0.1619 0.1719 0.0663 0.0398 0.4597 3.1773 0.6044 1.0266 1.1050 9.2911 0.1236 0.3510 9.0975 0.6997 8.2489 6.1092 25.3964 2.7309 7.2657 111.8515 18.8079 31.4415 10.2473 2.9311 9.0046 28.2790 23.8395 3.0240 0.7270 31.1799 55.5424 2.4843 4.0517 55.0707 24.5786 17.4200 13.3159 134.2912 89.7678 26.2470 118.2563 260.4694 88.0154 56.2370 32.0880 90.2959 82.1482 21.3548 21.5431 45.9674 344.9236 282.2682 1.7588 32.1891 18.5632 9.5979 0.7216 1.7437 1.2492 1.2060 88.8339
temp: 298.150 k
press: 1.00000 atm
elementType: 17 17 17 17 17 8 8 6 6 6 6 6 6 6 6 6 6 6 6 1 1 1 1 1
symmnumber: 1
zpe: 359000.0 jmol-1
zpe.correction: 0.136736 hartree
zpe.thermalcorrener: 0.154768 hartree
zpe.thermalcorrenthalpy: 0.155712 hartree
zpe.thermalcorrgfe: 0.087129 hartree
zpe.sumelectzpe: -2909.656416 hartree
zpe.sumelectthermal: -2909.638384 hartree
zpe.sumelectthermalent: -2909.637440 hartree
zpe.sumelectthermalfe: -2909.706023 hartree
dipole: -1.7443 1.2098 -0.2038
dipole: 2.1326
quadrupole: -152.1509 -147.2026 -144.6877
quadrupole: -2.6463 -3.3107 -0.3418
quadrupole: -4.1372 0.8112 3.3260 -2.6463 -3.3107 -0.3418
hfenergy: -2909.793152 hartree
pointgroup: C01 [X(C12H5Cl5O2)]
dipole: 0.6586119 0.1391763 0.5008056 debye
dipolederiv: -0.0823179 0.0431292 0.0627144 0.0512977 -0.3249217 -0.3385725 0.0625077 -0.3485975 -0.4068861 -0.1108605 0.013396 -0.0980284 0.0482395 -0.0641609 0.1510723 -0.2403393 0.1582656 -0.6117567 -0.0848108 0.0278005 0.0403411 0.1348936 -0.3268731 -0.3314559 0.1467469 -0.3386689 -0.3736112 -0.7140253 -0.1474598 -0.1732667 -0.1966434 -0.0668341 -0.0413349 -0.2070491 -0.0336436 -0.1064268 -0.7231662 0.0484602 0.2198219 0.0298773 -0.0358905 -0.0315024 0.2611955 -0.0413632 -0.1180324 -2.4078315 -0.1226471 0.0134614 -0.5474378 -0.2411877 -0.0434562 0.2968233 -0.0175183 -0.3482184 -0.3130258 0.1621907 -0.3399846 0.1394246 -0.3640939 0.1612824 -0.2758602 0.1633008 -1.2883934 1.438997 0.1267317 0.2822946 0.6617702 0.0911031 0.0936111 0.3385061 0.0014361 -0.08431 1.7514499 0.0407536 -0.1329932 0.0076958 0.0670905 -0.0819944 -0.8245234 -0.1287656 0.0146599 -0.0615968 -0.0796509 0.3017735 -0.0959203 0.1015649 -0.1991255 0.3202168 -0.2099771 1.2176469 -0.1641554 0.0183942 -0.0278185 -0.0392489 -0.0802264 0.0216294 -0.0066853 0.0572009 -0.177376 -0.2264797 -0.0380586 -0.0728721 -0.0721806 0.4197137 0.5999341 -0.0841988 0.6069753 0.5698548 -0.3450818 -0.0228601 -0.0092676 0.1461507 -0.1697778 -0.0897097 0.2840182 -0.0673001 -0.1913026 -0.1890036 0.034902 -0.2446986 -0.0300745 -0.093081 -0.0611057 -0.007692 0.0124607 -0.2287438 -0.2326971 -0.0832086 0.1667242 -0.1510606 -0.0207331 -0.2281322 0.2816115 -0.2727227 0.8489392 0.0069219 -0.013458 -0.0267646 -0.14332 0.4887882 0.5404994 -0.1485324 0.5652156 0.5399351 -0.161607 -0.0038505 0.0450527 0.037219 -0.094687 -0.0996679 0.0798606 -0.084127 -0.1467473 1.0420571 0.2844225 0.2224697 0.366396 0.0352535 0.0547138 0.1432091 0.0494685 0.0847559 0.9822834 -0.035528 -0.3190369 -0.0466091 -0.1361827 -0.0321788 -0.3863671 -0.0464472 0.00355 0.0796434 -0.04922 0.0301912 -0.0884673 0.1260754 0.0210028 0.0615602 0.0242062 0.0772637 0.1044402 -0.037484 -0.0044153 -0.0921144 0.1063453 -0.0386083 -0.0345605 -0.0445547 0.0963069 0.0720204 -0.0380375 0.0188335 -0.047146 0.1510885 0.032775 0.0120088 0.0400618 0.070105 0.0623852 -0.0315495 -0.0071284 -0.033302 0.1119211 -0.0464232 -0.0031457 -0.0503305 0.1151285 0.2764609 -0.0971679 0.0525967 -0.0394396 0.3197058 -0.0132528 -0.0693113 0.0054249 0.4436586 unknown
polarizability: 268.3049049|18.1426643|119.5594692|0.1636956|29.5805787|190.2962176 unknown
InChI: InChI=1S/C12H5Cl5O2/c13-5-1-9(17)11(3-7(5)15)19-12-4-8(16)6(14)2-10(12)18/h1-4,18H
charge 0 multiplicity 1
24 atoms
Cl 2.060876 2.23696 2.423676
Cl -3.229724 0.545846 -2.953693
Cl 2.967882 -1.992127 -2.323801
Cl -5.44112 -0.89361 -0.983464
Cl 5.484661 -0.196524 -1.181971
O  -0.008792 0.476102 1.220954
O  -1.883601 -0.742477 2.777795
C  -1.231931 0.13181 0.58184
C  1.233715 0.301629 0.583035
C  -2.187281 -0.459356 1.450572
C  -1.553322 0.452588 -0.747938
C  2.322134 1.05822 1.080158
C  1.449687 -0.632148 -0.453875
C  -3.469822 -0.766876 0.955143
C  -2.838712 0.138129 -1.235104
C  2.739678 -0.789109 -0.996793
C  3.610089 0.896063 0.54192
C  -3.788513 -0.473121 -0.385451
C  3.820612 -0.026521 -0.504338
H  -0.827693 0.944868 -1.400706
H  0.624705 -1.242323 -0.830108
H  -4.203569 -1.228491 1.619711
H  4.445312 1.485157 0.928537
H  -0.970471 -0.408787 2.985601
