program: Gaussian 09
title: 000005690
version: EM64L-G09RevD.01
frameworkgroup: C1[X(C27H26N2O3)]
method: RPBEPBE
basis: SDD
operation: Freq
keyword: #p
keyword: freq=noraman
keyword: PBEPBE/SDD
title: #p freq=noraman PBEPBE/SDD
converged: YES YES NO NO
title: Mulliken charges:
elementType: O O O N N C C C C C C C C C C C C C C C C C C C C C C C C C C C H H H H H H H H H H H H H H H H H H H H H H H H H H
charge: -0.253538 -0.243497 -0.254637 -0.239776 -0.109106 -0.130103 -0.360324 0.023873 -0.391685 0.204785 0.180629 0.075812 0.247569 -0.333794 -0.353372 -0.317838 -0.314586 -0.776970 -0.373058 -0.401622 -0.042819 -0.220520 0.326592 -0.570816 -0.388913 0.366423 0.375577 -0.438006 -0.416790 -0.411466 -0.246722 -0.239246 0.234360 0.218778 0.241501 0.257441 0.225821 0.199494 0.203718 0.200988 0.223464 0.219078 0.190112 0.192222 0.219201 0.243666 0.294709 0.206234 0.258420 0.245391 0.223127 0.276806 0.272438 0.238836 0.244841 0.239484 0.229499 0.228316
chargesum: 0.00000
title: Mulliken charges with hydrogens summed into heavy atoms:
elementType: O O O N N C C C C C C C C C C C C C C C C C C C C C C C C C C C
charge: -0.253538 -0.243497 -0.254637 -0.239776 -0.109106 0.104257 0.099955 0.023873 0.091577 0.204785 0.180629 0.075812 0.247569 0.069418 0.071080 0.091352 0.096837 -0.032361 -0.114638 -0.156231 -0.042819 0.002607 0.326592 -0.294010 -0.116475 0.366423 0.375577 -0.199170 -0.171948 -0.171982 -0.017223 -0.010930
polarizability: 5.26405065e+02 -5.71984107e+00 3.05095108e+02 -3.15364037e+01 8.69537228e+00 2.00560312e+02
1716.lowfreq: -13.1988 -0.0012 -0.0009 0.0008 1.4437 5.1511 16.2531 17.2189 23.9437
frequency: 15.8600 16.3325 23.3498 30.6966 36.4552 52.4106 64.1216 83.6592 94.2678 108.9661 126.5197 134.1938 155.6152 164.8464 194.5141 206.8785 219.1774 235.6661 242.6070 257.5226 289.8542 303.0664 315.5600 330.8226 341.3103 352.7062 373.5597 389.8863 393.9573 413.6689 429.4261 449.2371 461.5206 470.3424 481.1201 495.0695 511.4454 520.5935 545.0588 550.6004 573.6948 577.3540 584.8715 591.3900 618.8892 626.8358 639.6417 668.8020 688.5465 736.2904 737.6357 747.5294 758.4085 772.7153 781.4041 785.6505 791.5220 806.8776 814.0136 820.5112 837.3312 839.9808 851.4958 878.9894 883.9263 888.0745 909.2394 913.7914 929.6747 938.4003 959.3320 965.7718 975.3155 982.8468 994.2457 1000.9285 1021.4402 1022.3392 1026.6470 1031.6008 1035.2298 1039.9860 1051.0889 1053.9773 1080.3593 1098.6453 1100.3348 1105.4071 1127.5366 1137.6144 1144.0104 1159.1533 1165.3440 1173.2999 1180.2224 1191.6557 1212.7890 1228.0514 1229.1265 1242.4469 1246.9865 1259.2403 1273.0931 1274.0288 1276.5219 1291.4308 1295.6327 1310.4480 1326.1470 1334.8510 1345.4765 1349.5144 1359.1182 1359.2814 1362.4982 1371.4874 1387.1877 1397.4328 1406.9350 1408.7710 1420.9829 1422.0606 1431.3413 1436.6435 1443.0769 1449.3791 1450.7232 1455.1221 1458.3729 1461.6601 1463.0500 1470.1519 1477.5780 1480.1256 1502.7249 1511.2830 1522.7167 1577.5552 1589.2369 1600.8898 1637.4231 1642.4201 2877.8974 2886.2576 2907.0817 2952.7838 2958.2488 2974.9315 3002.4368 3016.8860 3021.8861 3036.7323 3045.5053 3047.4797 3083.5082 3087.4185 3118.4642 3120.9722 3122.1533 3125.2834 3127.9135 3137.1734 3141.1584 3143.7710 3159.4666 3162.5544 3167.1066 3176.4439
redmass: 3.9594 6.1156 3.8956 3.4852 2.7767 4.4302 1.7857 5.4890 4.8621 5.2253 2.8255 5.2795 5.3312 5.5657 3.7999 3.7654 3.8658 3.0123 2.4155 4.1021 3.8775 4.6015 2.6383 5.8210 3.4429 2.9032 4.3900 2.1319 2.9000 3.7158 4.0431 5.7988 4.8300 2.7606 2.6077 5.0255 6.8974 4.7183 4.9435 4.2129 4.8077 5.2853 5.3767 2.5077 4.8145 3.9983 5.6113 3.7123 4.2023 2.6364 3.4177 1.7849 3.4371 2.1906 4.1268 2.4281 2.9288 3.9320 4.7145 3.7814 1.4858 1.6158 3.2538 1.4354 1.6419 2.3425 3.8013 3.1313 2.6786 1.8040 1.3112 1.4840 2.4835 1.3760 1.3528 2.5649 2.5522 2.2843 2.3110 2.3300 2.3881 1.5370 2.1527 1.8705 3.2921 2.4284 2.8254 2.3888 1.8485 2.5446 2.3733 1.7471 1.4250 1.0889 1.2383 1.0652 1.3126 2.7201 2.1181 1.5133 1.4878 1.4396 1.8659 1.3519 2.1700 1.6762 1.3101 1.3399 1.8438 1.3517 1.4165 1.8092 1.9782 1.4394 1.6052 1.2642 1.4066 2.3546 1.9236 5.0252 3.6489 3.9504 3.1627 1.3867 1.0830 1.0864 1.0958 1.4546 1.1034 2.1169 2.3680 1.1183 1.2405 3.0488 4.6824 3.9967 6.1793 7.4186 7.8610 5.6205 6.8162 9.4345 1.0696 1.0690 1.0693 1.0669 1.0667 1.0400 1.0688 1.0828 1.0886 1.0918 1.0972 1.0913 1.0959 1.0976 1.0951 1.0859 1.1003 1.0886 1.0885 1.0873 1.0916 1.0950 1.0957 1.1003 1.0923 1.0971
irintensity: 0.1712 0.2603 0.0183 0.8239 1.5592 0.6584 0.0907 1.8770 2.8390 0.6191 1.6907 0.2348 2.2592 2.3804 1.0975 7.4182 7.1281 4.5085 1.1703 5.3614 0.5826 8.7470 16.7215 2.5794 2.4608 0.4869 0.4008 0.7302 0.4922 2.5398 6.8916 9.2763 2.9727 1.0603 19.4386 5.6045 0.6416 8.2784 1.1126 6.4767 1.3406 26.6458 0.8354 6.7116 1.2440 1.7598 3.0109 1.7517 9.5804 35.5167 0.4566 26.8831 7.7439 31.0542 1.4849 24.0037 32.4448 20.6777 77.7579 6.8786 25.4750 2.8830 6.3058 5.1477 12.8828 16.4552 18.3225 37.8990 0.2208 13.9360 2.9962 3.9289 10.3942 4.8915 0.0141 44.7937 5.2293 14.6692 4.2358 3.0750 23.9909 11.6231 2.9756 22.2635 29.0084 36.0168 32.0897 4.2624 79.3921 106.0661 21.5155 69.3323 111.3968 6.3393 9.5013 1.2839 42.4828 74.3778 34.1739 12.9306 3.3806 23.5065 25.6108 6.1951 90.6768 30.8438 3.4072 4.5211 16.5873 5.7946 8.2971 1.1324 3.5904 7.6975 2.6126 3.6329 7.6586 270.0826 180.6942 17.9394 8.2474 8.2337 7.0134 29.7251 3.7569 1.9610 17.3985 22.9374 4.6512 25.6321 49.8881 4.8299 9.8775 43.5528 191.2250 188.1991 105.4491 10.0642 45.0956 20.2234 23.3526 39.6432 45.0182 75.2183 78.9804 35.5956 94.3489 42.0292 26.6130 29.3047 59.7387 23.4101 17.6589 23.6482 35.1719 36.9367 2.6329 1.4303 6.7741 7.8711 0.7514 9.9898 0.5506 31.8141 16.8069 41.9724 8.1805 12.0031
temp: 298.150 k
press: 1.00000 atm
elementType: 8 8 8 7 7 6 6 6 6 6 6 6 6 6 6 6 6 6 6 6 6 6 6 6 6 6 6 6 6 6 6 6 1 1 1 1 1 1 1 1 1 1 1 1 1 1 1 1 1 1 1 1 1 1 1 1 1 1
symmnumber: 1
zpe: 1230687.1 jmol-1
zpe.correction: 0.468744 hartree
zpe.thermalcorrener: 0.495581 hartree
zpe.thermalcorrenthalpy: 0.496525 hartree
zpe.thermalcorrgfe: 0.408986 hartree
zpe.sumelectzpe: -1377.366829 hartree
zpe.sumelectthermal: -1377.339993 hartree
zpe.sumelectthermalent: -1377.339048 hartree
zpe.sumelectthermalfe: -1377.426588 hartree
dipole: -1.3855 1.2673 1.6506
dipole: 2.5000
quadrupole: -175.9124 -191.8165 -181.4982
quadrupole: 5.6500 -7.1406 0.0596
quadrupole: 7.1633 -8.7408 1.5775 5.6500 -7.1406 0.0596
hfenergy: -1377.8355732 hartree
pointgroup: C01 [X(C27H26N2O3)]
dipole: 0.5264517 -0.3706302 0.7435908 debye
polarizability: 525.3638454|-3.9726939|297.5847943|35.9208056|-29.2547505|209.1118455 unknown
InChI: InChI=1S/C27H26N2O3/c1-18-25(27(30)21-10-9-19-5-2-3-6-20(19)15-21)23-7-4-8-24-26(23)29(18)22(17-32-24)16-28-11-13-31-14-12-28/h2-10,15,22H,11-14,16-17H2,1H3
charge 0 multiplicity 1
58 atoms
O  2.967272 -2.577424 0.757711
O  8.150658 1.053275 -0.641153
O  -1.483915 2.523074 -0.875435
N  1.68855 -0.000897 0.486643
N  5.393607 0.215275 -0.301144
C  3.140719 -0.042634 0.746283
C  3.950419 0.06864 -0.578635
C  1.008229 -1.210539 0.321064
C  3.451797 -1.370683 1.486814
C  0.807606 1.052905 0.242523
C  -0.347655 -0.958068 -0.02249
C  -0.474693 0.506683 -0.051999
C  1.593389 -2.483061 0.422199
C  5.807304 1.622255 -0.055068
C  6.267896 -0.412464 -1.328662
C  7.283223 1.666257 0.376491
C  7.734696 -0.34065 -0.873935
C  1.246822 2.48323 0.339423
C  -1.157236 -2.094225 -0.312317
C  0.787006 -3.596388 0.143146
C  -1.637411 1.344488 -0.393833
C  -0.57579 -3.379606 -0.228139
C  -3.036524 0.837151 -0.157146
C  -4.06861 1.322439 -0.973402
C  -3.356489 -0.045511 0.93168
C  -5.428521 0.937286 -0.761567
C  -5.744571 0.046328 0.33908
C  -4.676779 -0.420338 1.176031
C  -6.493062 1.412841 -1.599274
C  -7.110148 -0.330756 0.558185
C  -7.813972 1.027649 -1.36205
C  -8.124732 0.148279 -0.274454
H  3.421169 0.790478 1.418713
H  3.543492 0.91107 -1.186112
H  3.787348 -0.859721 -1.156103
H  4.542891 -1.492058 1.554284
H  2.992785 -1.363784 2.494251
H  5.18082 2.060714 0.745173
H  5.673622 2.247076 -0.973008
H  6.168398 0.096226 -2.318776
H  5.971268 -1.470525 -1.452755
H  7.636925 2.70532 0.479046
H  7.403226 1.132278 1.344122
H  7.864263 -0.930634 0.05913
H  8.412815 -0.724719 -1.653356
H  1.743839 2.816305 -0.59223
H  0.369689 3.134567 0.465951
H  1.952151 2.638455 1.177812
H  -2.205454 -1.985157 -0.602286
H  1.202009 -4.606665 0.205549
H  -1.19465 -4.255374 -0.453153
H  -3.814294 2.021114 -1.778774
H  -2.553443 -0.403849 1.583125
H  -4.914134 -1.079228 2.019848
H  -6.251266 2.087264 -2.429244
H  -7.348146 -1.002955 1.391334
H  -8.620027 1.396247 -2.005774
H  -9.165484 -0.146157 -0.099336
