program: Gaussian 09
title: 000043665
version: EM64L-G09RevD.01
frameworkgroup: C1[X(C9H9Cl3)]
method: RPBEPBE
basis: SDD
operation: Freq
keyword: #pfreq=noraman
keyword: PBEPBE/SDD
title: #p freq=noraman PBEPBE/SDD
converged: YES YES NO NO
title: Mulliken charges:
elementType: Cl Cl Cl C C C C C C C C C H H H H H H H H H
charge: -0.011062 -0.050162 -0.003788 -0.204710 0.768417 -0.686430 -0.686425 -0.326257 -0.353268 -0.096094 -0.227662 -0.232347 0.230098 0.229847 0.218316 0.224975 0.224977 0.218318 0.229848 0.265541 0.267869
chargesum: 0.00000
title: Mulliken charges with hydrogens summed into heavy atoms:
elementType: Cl Cl Cl C C C C C C C C C
charge: -0.011062 -0.050162 -0.003788 0.025388 0.768417 -0.013292 -0.013283 -0.326257 -0.353268 -0.096094 0.037879 0.035522
polarizability: 1.69056152e+02 2.24668362e+00 1.34742228e+02 -8.73468595e-03 -4.42489739e-04 6.71286449e+01
1716.lowfreq: -11.5296 -7.4456 -5.7051 -0.0043 -0.0030 -0.0022 57.3461 62.4221 96.8246
frequency: 57.2803 62.4194 96.8244 166.8250 187.9841 202.1818 207.9705 209.9944 218.1077 265.5646 286.4484 310.8092 345.9919 374.4053 404.0006 472.3438 531.8330 549.6046 583.4657 616.1077 730.1663 748.7985 787.3764 804.6727 900.8410 925.1146 939.8896 960.6217 1026.8349 1070.5960 1117.5866 1129.4008 1144.3154 1179.7155 1221.6862 1302.3103 1321.1840 1359.9204 1378.4371 1381.1883 1398.7891 1421.3749 1465.5404 1476.7803 1478.9077 1493.8063 1550.9395 1575.8045 2988.8572 2990.9201 3044.8746 3077.7613 3081.4690 3105.1660 3111.6087 3168.2233 3186.9334
redmass: 5.6760 3.2186 5.9932 1.6882 3.4434 2.3420 2.3740 1.7547 7.6880 3.1505 7.0248 24.7753 4.1402 6.6000 3.1193 5.5625 4.5355 6.3643 5.0242 3.7145 7.9250 7.5873 5.1306 1.3412 2.6789 1.1878 1.3414 1.4122 5.6006 1.8039 2.8865 2.2740 1.6740 1.9157 2.2714 3.1440 1.2644 5.2134 1.1828 1.7032 1.2658 2.1632 1.0429 1.0498 1.0454 1.0619 6.5600 8.8386 1.0359 1.0365 1.0836 1.1000 1.0992 1.0993 1.0979 1.0889 1.0983
irintensity: 0.3684 0.3429 0.7569 0.6547 0.4709 0.7445 0.4536 0.2364 0.5929 0.3923 0.9685 0.0282 4.7296 2.9710 0.8254 12.1110 2.0221 13.4528 2.2920 17.5931 35.3857 0.1970 15.8530 45.2685 23.8879 4.3616 0.0453 0.0002 29.1293 53.7410 1.9607 12.8065 10.2894 19.7931 15.6108 35.8145 0.5816 12.5985 20.3454 0.8720 11.3444 76.4166 1.5600 2.8968 14.9541 12.2187 7.8106 1.5897 37.1586 33.6706 3.6161 17.0508 49.0281 1.0446 29.1494 0.1283 0.6664
temp: 298.150 k
press: 1.00000 atm
elementType: 17 17 17 6 6 6 6 6 6 6 6 6 1 1 1 1 1 1 1 1 1
symmnumber: 1
zpe: 401936.7 jmol-1
zpe.correction: 0.153090 hartree
zpe.thermalcorrener: 0.165741 hartree
zpe.thermalcorrenthalpy: 0.166685 hartree
zpe.thermalcorrgfe: 0.113407 hartree
zpe.sumelectzpe: -1727.642053 hartree
zpe.sumelectthermal: -1727.629402 hartree
zpe.sumelectthermalent: -1727.628458 hartree
zpe.sumelectthermalfe: -1727.681735 hartree
dipole: -1.0243 -0.8109 0.0001
dipole: 1.3064
quadrupole: -96.4991 -84.5429 -93.6022
quadrupole: -5.4326 0.0002 0.0004
quadrupole: -4.9510 7.0052 -2.0541 -5.4326 0.0002 0.0004
hfenergy: -1727.7951426 hartree
pointgroup: C01 [X(C9H9Cl3)]
dipole: 0.3001753 -0.4172105 -0.0000214 debye
dipolederiv: -0.1103254 0.0781001 0.0000057 0.1078711 -0.6754515 -0.0000183 0.0000062 -0.0000174 -0.0323468 -0.6233235 0.2716549 0.0000643 0.2797501 -0.3197699 -0.0000337 0.0000578 -0.0000371 -0.0704884 -0.708785 0.1963958 0.0000556 0.2316892 -0.1357418 -0.0000193 0.0000556 -0.0000167 -0.0315839 0.0368534 0.0025787 -0.0000126 0.1776967 0.1451112 -0.0000131 -0.0000229 -0.0000226 0.1128078 -0.0314772 0.2739124 0.0000241 0.2152245 -0.2392281 -0.0000231 0.0000164 -0.0000257 -0.0355264 -0.0175528 -0.0149879 0.0351859 -0.0949363 0.0092855 0.0189978 -0.0308107 -0.0484222 -0.0227013 -0.0175516 -0.0150173 -0.0351941 -0.0948945 0.0093047 -0.0189941 0.0308462 0.0484348 -0.0226944 -0.1041236 -0.1976341 0.0000028 -0.0572065 0.916763 0.0000211 0.0000072 0.0000371 -0.0537025 0.8003432 -0.4258097 -0.0001042 -0.4867515 0.3800934 0.0000586 -0.0001058 0.0000549 -0.070559 0.9800039 -0.2374282 -0.0000795 -0.4204949 -0.0042416 0.0000313 -0.0000833 0.0000176 -0.0303205 -0.1617846 0.0568028 0.00001 0.0862311 -0.0447349 -0.0000064 0.0000117 -0.0000069 -0.1015213 -0.2080059 0.0377901 0.0000077 0.0842749 -0.0332367 -0.0000051 0.0000068 -0.0000019 -0.1086879 0.0621113 0.0635885 -0.0000068 -0.0008566 -0.0564973 0.0000108 -0.0000008 0.0000078 0.0312066 0.0689004 0.0626238 0.0230809 0.1291273 -0.0454765 -0.0504764 -0.0184691 0.007199 0.0780177 -0.0901141 -0.1383911 0.0339455 -0.1501494 -0.0323777 0.0075104 0.0276733 -0.0099272 0.0787 0.0308881 0.0397687 -0.1261365 0.0233777 0.0891032 0.0196667 -0.0768926 0.0156654 -0.1062692 0.0309172 0.0398391 0.1261167 0.0234077 0.0890706 -0.0197736 0.0768493 -0.0157432 -0.106272 -0.0901949 -0.1383991 -0.0338961 -0.1501348 -0.0322916 -0.0074564 -0.0276124 0.0099615 0.0787037 0.0689525 0.0625782 -0.0230892 0.1290631 -0.0455384 0.0505266 0.0184469 -0.0071526 0.0780094 0.079297 0.0296643 0.0000072 0.0085249 -0.0241352 -0.0000045 0.0000088 -0.0000071 0.1649491 0.0049714 -0.04763 0.0000125 -0.0408136 0.0499896 0.0000006 0.0000111 0.0000026 0.1702792 unknown
polarizability: 165.297999|-10.9490111|138.5003805|-0.0082794|0.0028181|67.1286449 unknown
InChI: InChI=1S/C9H9Cl3/c1-5(2)8-6(10)3-4-7(11)9(8)12/h3-5H,1-2H3
charge 0 multiplicity 1
21 atoms
Cl -1.080467 2.501311 0.000141
Cl 2.138175 -2.162258 -0.000222
Cl -3.663495 0.589142 0.000309
C  1.70865 1.071629 -0.000094
C  0.480423 0.150916 -0.000017
C  2.562281 0.928163 -1.290157
C  2.562317 0.928288 1.289951
C  -0.841462 0.694097 0.000092
C  0.538063 -1.269689 -0.000047
C  -1.996331 -0.120551 0.000169
C  -0.597985 -2.100384 0.000025
C  -1.881008 -1.522207 0.000137
H  1.320749 2.104365 -0.000132
H  3.044623 -0.05994 -1.364151
H  3.356706 1.696674 -1.283394
H  1.946312 1.084079 -2.193988
H  1.946447 1.084709 2.193763
H  3.357003 1.696527 1.282891
H  3.04433 -0.059954 1.364239
H  -0.481761 -3.186944 -0.000009
H  -2.77757 -2.146974 0.000195
