program: Gaussian 09
title: 000005377
version: EM64L-G09RevD.01
frameworkgroup: C1[X(C26H29NO2)]
method: RPBEPBE
basis: SDD
operation: Freq
keyword: #p
keyword: freq=noraman
keyword: PBEPBE/SDD
title: #p freq=noraman PBEPBE/SDD
converged: YES YES NO NO
title: Mulliken charges:
elementType: O O N C C C C C C C C C C C C C C C C C C C C C C C C C C H H H H H H H H H H H H H H H H H H H H H H H H H H H H H
charge: -0.267641 -0.441955 -0.095748 0.092479 0.174907 0.280273 -0.556469 0.352971 0.323120 -0.410952 -0.373096 -0.689811 0.336380 -0.593035 -0.436435 -0.373601 -0.382789 -0.387332 -0.418611 -0.381588 -0.283727 0.307130 -0.194539 -0.229887 -0.241623 -0.383816 -0.249071 -0.614192 -0.613361 0.212238 0.254936 0.242274 0.255749 0.209758 0.215940 0.238288 0.244132 0.256660 0.249556 0.249332 0.252124 0.227606 0.203009 0.224893 0.222971 0.206537 0.225621 0.225307 0.222655 0.250306 0.226597 0.229046 0.191168 0.222565 0.226793 0.193352 0.219667 0.352943
chargesum: 0.00000
title: Mulliken charges with hydrogens summed into heavy atoms:
elementType: O O N C C C C C C C C C C C C C C C C C C C C C C C C C C
charge: -0.267641 -0.089013 -0.095748 0.092479 0.174907 0.280273 -0.089295 0.352971 0.323120 -0.168678 -0.117347 -0.025825 0.336380 -0.348903 -0.179775 -0.124045 -0.133458 -0.135208 -0.191005 0.046313 0.145781 0.307130 0.031083 -0.004581 -0.018969 -0.133510 -0.022473 0.028586 0.026451
polarizability: 4.44001295e+02 -2.27331370e+01 3.04409414e+02 -8.01926750e+00 5.74118203e+00 2.13528864e+02
1716.lowfreq: -5.7352 -0.0010 -0.0007 0.0006 3.7042 4.2697 17.3982 24.9574 32.0768
frequency: 17.3946 24.9257 32.0307 36.1252 42.3945 49.5135 53.5212 65.3273 66.6616 76.6161 100.4147 102.2676 128.7019 145.0283 161.5961 174.8298 191.2953 198.3976 207.1157 219.8368 228.4050 238.8678 248.3308 257.0233 280.3272 298.6158 317.1563 347.3453 362.4627 368.1464 394.4512 404.2366 409.6452 417.4881 427.9453 434.5103 454.2755 479.9607 503.7688 517.1362 518.6158 548.1700 563.6238 614.4592 618.2115 622.2653 634.6858 663.1961 681.6415 700.9730 704.1197 735.7596 758.7028 771.3920 780.8087 793.4709 802.0930 813.5310 826.0206 837.6872 844.4393 844.7625 851.7515 866.1695 896.4894 917.9069 935.8241 946.2145 966.7186 971.2871 975.1611 976.0093 978.0834 985.1160 988.0672 992.9910 1005.4491 1024.7865 1033.8594 1036.1219 1049.9883 1059.6748 1063.0488 1076.3303 1086.8794 1090.4400 1095.4385 1103.4157 1117.1952 1135.8575 1138.6693 1166.5612 1169.3558 1172.1809 1173.2596 1180.4832 1191.0099 1227.1975 1234.0945 1248.6939 1248.9436 1268.8878 1272.4863 1294.5532 1297.6246 1307.6062 1312.2745 1318.6248 1321.6929 1332.5988 1356.7984 1369.8943 1380.8941 1387.4066 1391.2870 1417.3802 1422.6686 1425.6193 1431.5175 1443.8079 1462.6929 1468.0123 1470.7598 1471.8934 1473.8901 1476.8530 1479.1728 1483.6622 1486.1010 1486.9061 1488.8337 1497.9440 1567.3492 1573.7697 1589.5071 1600.2577 1605.6458 1606.7699 1616.2417 2855.2327 2865.0130 2893.6113 2967.2535 2968.5152 2979.6798 3021.0698 3027.4133 3030.9068 3057.1057 3059.5061 3073.4331 3080.2385 3084.9267 3086.4706 3110.4395 3118.9575 3126.4405 3134.7830 3136.0072 3137.7851 3139.2622 3150.0069 3160.6466 3161.8070 3163.6233 3166.1105 3174.5405 3579.2754
redmass: 4.8774 4.5751 3.5197 4.1914 3.6032 4.1453 4.2777 3.9956 4.0052 3.8936 3.2190 3.0658 2.3488 3.4560 4.6008 5.3615 2.8787 2.3994 1.2516 1.1275 3.1632 1.7924 4.1687 3.0319 4.0355 4.3479 3.3271 2.7018 1.1311 3.2571 3.1275 2.8682 3.7130 3.0185 2.6701 3.0597 3.2806 3.9362 3.7624 6.7561 3.3334 4.2392 3.9747 6.2947 4.8946 5.3075 5.8417 5.3971 3.7468 1.7532 2.3810 3.0710 2.8259 2.1607 3.6458 1.5144 1.7178 1.3640 1.9701 1.7190 2.7358 1.9673 1.2824 1.6870 1.4137 1.4715 2.5495 1.4256 2.3958 1.4822 1.3684 1.4747 5.4882 5.5213 5.8557 1.3314 2.5571 2.4267 2.2481 1.5356 2.6576 1.6934 1.6048 1.6528 1.6870 1.5460 1.9652 1.9137 1.3520 1.6284 1.4419 1.4220 1.4691 1.1265 1.1132 1.2696 1.1155 2.7683 2.4237 1.5810 1.8108 2.5038 2.4897 1.2044 1.7881 1.5246 1.3638 1.6473 1.5855 1.3914 4.5443 6.1582 7.1565 1.2156 1.4362 3.8108 1.1429 2.8997 2.3390 1.1628 1.0484 1.0685 1.1373 1.0988 1.0882 1.0547 1.8093 1.1471 1.0657 1.0932 2.4661 2.2228 7.1310 6.3759 7.5458 6.2404 6.1188 6.4346 6.3859 1.0567 1.0577 1.0689 1.0677 1.0561 1.0352 1.0732 1.0768 1.0958 1.0973 1.0919 1.1000 1.1008 1.1006 1.0989 1.0911 1.0846 1.0871 1.0871 1.0878 1.0883 1.0924 1.0957 1.0949 1.0928 1.1012 1.0963 1.0980 1.0659
irintensity: 0.0425 0.0560 0.1777 0.0652 0.6475 0.0161 0.1057 0.5444 0.1740 0.2643 0.7284 0.3323 2.3530 1.0842 0.4921 0.0188 0.4228 0.3727 0.4435 1.0545 0.5940 1.0793 1.9102 0.7932 3.6288 1.4585 0.8824 9.3468 121.3935 6.7236 3.4626 0.5847 12.0253 0.0785 3.7691 3.0809 5.1897 2.0373 11.3749 4.7780 9.1243 15.7132 9.1112 2.2673 4.4709 7.4646 5.2321 3.2382 13.3408 51.6104 24.7663 3.6746 17.8392 27.7321 26.3395 55.4102 43.1030 0.7141 8.2193 1.7185 22.9587 26.2499 1.2207 19.9003 0.5431 3.0674 4.0616 1.6866 26.0408 3.4436 2.1602 8.6410 92.2292 3.5241 0.1969 0.3693 9.7320 10.0384 73.5404 15.9882 5.2884 3.6633 5.7969 21.2994 7.8627 16.1436 6.4559 20.8092 12.3280 188.6521 3.5401 18.1313 28.7831 5.5218 2.4660 138.2235 0.5382 280.0245 35.6521 6.1599 6.4740 18.0478 17.7990 2.4106 8.5569 4.5006 4.0039 2.9564 5.2738 3.2551 23.8693 1.9636 2.7318 15.3775 2.1417 5.9613 3.8967 53.1557 15.4260 4.9685 9.4833 4.9165 16.2220 28.5809 12.0889 10.4943 3.5098 77.6334 8.7609 9.2769 10.4330 125.8646 13.0809 1.6727 14.2508 97.3086 30.0058 9.6375 106.3229 69.4914 181.5883 106.3549 24.5267 34.1478 40.4448 39.7398 47.9113 13.1897 36.8896 4.0030 44.8732 32.2860 63.3795 44.3949 11.1032 5.1237 0.4835 10.4310 8.4352 13.9520 23.4980 38.2333 16.3262 8.5323 25.7086 5.6167 11.4932 30.4690
temp: 298.150 k
press: 1.00000 atm
elementType: 8 8 7 6 6 6 6 6 6 6 6 6 6 6 6 6 6 6 6 6 6 6 6 6 6 6 6 6 6 1 1 1 1 1 1 1 1 1 1 1 1 1 1 1 1 1 1 1 1 1 1 1 1 1 1 1 1 1
symmnumber: 1
zpe: 1260322.0 jmol-1
zpe.correction: 0.480031 hartree
zpe.thermalcorrener: 0.508549 hartree
zpe.thermalcorrenthalpy: 0.509493 hartree
zpe.thermalcorrgfe: 0.418398 hartree
zpe.sumelectzpe: -1211.216799 hartree
zpe.sumelectthermal: -1211.188281 hartree
zpe.sumelectthermalent: -1211.187337 hartree
zpe.sumelectthermalfe: -1211.278431 hartree
dipole: -2.9560 -2.1019 0.5017
dipole: 3.6616
quadrupole: -144.8072 -175.8579 -169.1605
quadrupole: -3.7911 -4.7893 3.3750
quadrupole: 18.4680 -12.5827 -5.8853 -3.7911 -4.7893 3.3750
hfenergy: -1211.6968298 hartree
pointgroup: C01 [X(C26H29N1O2)]
dipole: 1.1553022 -0.7656913 -0.3928395 debye
polarizability: 443.1816612|25.1538178|303.5093627|-11.3083571|11.0432029|215.2485495 unknown
InChI: InChI=1S/C26H29NO2/c1-4-25(20-9-6-5-7-10-20)26(22-11-8-12-23(28)19-22)21-13-15-24(16-14-21)29-18-17-27(2)3/h5-16,19,28H,4,17-18H2,1-3H3
charge 0 multiplicity 1
58 atoms
O  4.432397 0.583664 0.601348
O  -1.952461 4.800914 -0.447518
N  7.756093 -0.159104 -0.932005
C  -1.275011 -0.103067 0.279693
C  -1.900324 -1.320024 0.058096
C  0.217397 0.039326 0.333624
C  -1.146567 -2.649908 0.077616
C  -2.039425 1.16688 0.532879
C  -3.368361 -1.434019 -0.227974
C  1.060354 -0.468308 -0.689113
C  0.838754 0.744314 1.406473
C  -1.16335 -3.410165 -1.274253
C  3.055182 0.371697 0.444764
C  -1.627913 2.376159 -0.090759
C  -3.137925 1.208966 1.433811
C  2.463659 -0.310663 -0.647183
C  2.232705 0.902779 1.471205
C  -3.982553 -0.609754 -1.213147
C  -4.176093 -2.411393 0.41812
C  6.759402 0.392661 0.015018
C  5.333812 0.036916 -0.428914
C  -2.319259 3.582655 0.158218
C  -3.816838 2.422682 1.678133
C  -5.351352 -0.742939 -1.525154
C  -5.549055 -2.540875 0.114305
C  -3.42127 3.618483 1.042469
C  -6.145258 -1.707057 -0.859804
C  9.000452 0.634646 -0.989588
C  8.030294 -1.595304 -0.716424
H  -1.618766 -3.304303 0.839731
H  -0.106319 -2.492737 0.407384
H  0.609613 -0.979938 -1.546627
H  0.213035 1.164308 2.201641
H  -0.6618 -2.826505 -2.067904
H  -0.640886 -4.380107 -1.18186
H  -2.197846 -3.607598 -1.606954
H  -0.765176 2.363562 -0.770252
H  -3.451323 0.291893 1.94091
H  3.073266 -0.708485 -1.463988
H  2.707767 1.431269 2.303514
H  -3.373758 0.136167 -1.734805
H  -3.734487 -3.062838 1.181288
H  6.915198 0.03813 1.062985
H  6.851114 1.493402 0.029467
H  5.118567 0.492921 -1.414782
H  5.191226 -1.060164 -0.50274
H  -4.661147 2.440454 2.376121
H  -5.799123 -0.096351 -2.288431
H  -6.152638 -3.2917 0.637255
H  -3.93372 4.568113 1.222012
H  -7.209514 -1.809602 -1.099978
H  8.764306 1.683123 -1.242837
H  9.57913 0.629978 -0.031247
H  9.657361 0.233286 -1.782378
H  8.687335 -1.971338 -1.520732
H  8.527883 -1.802907 0.2650
H  7.093357 -2.177584 -0.750936
H  -1.15964 4.676988 -1.02649
