program: Gaussian 09
title: 000043671
version: EM64L-G09RevD.01
frameworkgroup: C1[X(C12H14F3NO3)]
method: RPBEPBE
basis: SDD
operation: Freq
keyword: #p
keyword: freq=noraman
keyword: PBEPBE/SDD
title: #p freq=noraman PBEPBE/SDD
converged: YES YES NO NO
title: Mulliken charges:
elementType: F F F O O O N C C C C C C C C C C C C H H H H H H H H H H H H H H
charge: -0.166155 -0.165443 -0.166930 -0.296453 -0.412959 -0.235153 -0.304822 -0.190313 -0.391495 0.474990 -0.483030 -0.433888 0.295289 -0.201700 -0.363198 -0.412537 0.244615 -0.507655 0.180711 0.216017 0.218344 0.215903 0.295561 0.310566 0.246541 0.238541 0.266903 0.252846 0.222758 0.220675 0.209563 0.238936 0.382973
chargesum: 0.00000
title: Mulliken charges with hydrogens summed into heavy atoms:
elementType: F F F O O O N C C C C C C C C C C C C
charge: -0.166155 -0.165443 -0.166930 -0.296453 -0.029987 -0.235153 0.005744 0.025704 0.042752 0.474990 -0.187469 -0.187347 0.295289 0.036841 -0.096295 0.063067 0.244615 0.161519 0.180711
polarizability: 1.91185357e+02 -1.23927395e+00 1.25185443e+02 1.11050677e+01 -1.12557843e+01 1.26040861e+02
1716.lowfreq: -2.6685 0.0005 0.0011 0.0013 3.4992 7.6358 16.5155 19.0570 29.6914
frequency: 16.2494 18.9794 29.6759 42.9147 48.4406 75.5636 88.1722 114.9632 122.4769 126.7442 155.7782 174.9555 218.0107 238.6730 244.6773 251.3046 301.5231 322.8518 338.6350 365.7614 417.6594 428.9018 438.9383 490.6780 506.4027 514.7567 537.5258 590.6563 607.9989 625.4514 638.8745 643.0137 698.7616 703.9601 711.7561 799.7595 813.3007 872.1047 886.7553 932.6134 939.5862 976.6045 985.2493 989.2906 993.9828 996.3179 1013.1469 1031.1998 1050.1346 1054.8100 1081.9650 1103.9139 1117.7364 1121.7877 1157.8516 1173.9688 1186.2786 1192.8718 1199.0413 1236.4000 1254.8717 1268.0226 1291.1197 1305.6259 1334.9548 1338.9534 1388.5469 1391.9756 1431.5454 1440.9887 1456.6463 1459.4076 1461.3188 1474.8299 1475.1309 1477.5362 1600.8092 1617.4401 1672.7284 2834.1819 2864.3782 2946.1428 2955.1697 3009.9585 3012.6562 3029.3537 3111.4844 3126.4190 3152.5963 3157.0520 3173.9024 3466.5571 3517.1481
redmass: 11.9153 8.4248 5.6179 6.7914 5.0473 3.5681 4.1035 3.2645 3.0473 7.3262 1.7974 2.1411 4.7084 3.4647 3.5861 3.9455 6.5215 8.2702 5.1474 9.1046 3.9460 4.8738 5.8476 3.7768 2.3542 7.3355 3.2364 4.3879 11.8613 5.0307 2.5030 2.2286 1.3932 4.5500 2.1719 2.7542 1.5954 3.8356 4.9919 1.4372 1.4486 2.0948 7.6841 5.9797 1.4312 2.3310 5.7511 4.6248 2.3527 3.3192 3.7645 1.9016 1.3751 1.7858 1.4620 1.9531 1.0961 1.6194 1.9267 1.3904 1.3530 1.5873 1.8941 1.7655 1.3379 1.5999 1.6339 7.0580 1.3556 2.0707 1.2313 1.0725 1.1072 1.2712 1.0965 1.8012 6.2292 6.3003 8.4070 1.0716 1.0703 1.0354 1.0811 1.0882 1.0845 1.1030 1.0990 1.0888 1.0914 1.0920 1.0982 1.0745 1.0640
irintensity: 0.3247 0.5263 0.4530 1.1837 1.0338 4.0368 0.3893 0.5921 6.2977 0.4169 1.7431 0.1469 2.7666 4.8525 6.6079 0.9859 2.6381 8.6498 2.7072 6.9509 3.1042 12.0159 14.0900 10.9635 32.0782 3.6508 2.6377 12.5528 22.5621 9.7335 83.7514 56.4377 118.4719 11.4711 11.3135 13.0586 61.0684 7.6578 30.2303 5.6649 39.2005 16.8315 183.6947 4.7582 4.6733 0.6118 150.1419 203.1295 254.9348 48.9889 45.2093 21.5341 5.8586 14.8448 45.2205 30.1762 5.5892 7.4505 115.8534 15.5907 21.0696 27.6180 135.3912 69.5257 16.9700 14.9113 43.3316 2.7677 1.3874 30.5604 28.3617 4.0668 56.8665 8.9587 2.1168 10.0083 2.9832 3.2833 215.9371 95.1373 82.5286 53.1724 48.9303 33.3860 22.0095 54.3042 23.1318 6.7467 8.9663 0.2350 8.4291 16.4890 27.9364
temp: 298.150 k
press: 1.00000 atm
elementType: 9 9 9 8 8 8 7 6 6 6 6 6 6 6 6 6 6 6 6 1 1 1 1 1 1 1 1 1 1 1 1 1 1
symmnumber: 1
zpe: 647525.5 jmol-1
zpe.correction: 0.246629 hartree
zpe.thermalcorrener: 0.266051 hartree
zpe.thermalcorrenthalpy: 0.266995 hartree
zpe.thermalcorrgfe: 0.194825 hartree
zpe.sumelectzpe: -1044.177310 hartree
zpe.sumelectthermal: -1044.157888 hartree
zpe.sumelectthermalent: -1044.156944 hartree
zpe.sumelectthermalfe: -1044.229115 hartree
dipole: 1.7563 3.0435 -1.8250
dipole: 3.9596
quadrupole: -116.4225 -106.0452 -108.8839
quadrupole: -14.7900 -2.4629 -0.8273
quadrupole: -5.9719 4.4053 1.5666 -14.7900 -2.4629 -0.8273
hfenergy: -1044.4239393 hartree
pointgroup: C01 [X(C12H14F3N1O3)]
dipole: 0.652678 -0.8790939 1.1081562 debye
polarizability: 191.6929386|-3.1226965|118.0027565|-9.2931861|-8.247625|132.7159666 unknown
InChI: InChI=1S/C12H14F3NO3/c1-19-10(6-16-7-11(17)18)8-3-2-4-9(5-8)12(13,14)15/h2-5,10,16-17H,6-7H2,1H3
charge 0 multiplicity 1
33 atoms
F  -4.94507 1.51601 0.19416
F  -3.191347 2.227532 -1.062863
F  -4.444069 0.473549 -1.75337
O  0.871343 -0.919804 -1.52348
O  6.287054 1.264172 0.83933
O  5.522384 0.065059 -1.000935
N  2.98052 -0.171695 0.187121
C  0.704176 -1.058526 -0.066351
C  1.576139 0.058335 0.53998
C  -0.755492 -0.936565 0.361207
C  -1.61071 -0.019262 -0.291456
C  -1.259115 -1.703836 1.43973
C  -2.947872 0.127684 0.140319
C  -2.595218 -1.549313 1.872206
C  -3.44867 -0.632306 1.223539
C  3.930923 0.786722 0.746275
C  -3.858379 1.068293 -0.595393
C  0.407454 -2.089212 -2.278158
C  5.289517 0.635091 0.085768
H  1.11817 -2.037496 0.261735
H  1.462353 0.040172 1.641674
H  1.177999 1.042664 0.185111
H  -1.224596 0.561608 -1.135671
H  3.110453 -0.327644 -0.82131
H  -0.602599 -2.424294 1.94314
H  -2.974209 -2.144886 2.708918
H  -4.48411 -0.503827 1.552822
H  4.050277 0.644575 1.83737
H  3.636452 1.860769 0.607072
H  -0.681496 -2.251886 -2.150837
H  0.952958 -3.003941 -1.967582
H  0.624945 -1.8714 -3.335143
H  7.157232 1.191857 0.360974
