program: Gaussian 09
title: 000043699
version: EM64L-G09RevD.01
frameworkgroup: C1[X(C13H29NO6S2)]
method: RPBEPBE
basis: SDD
operation: Freq
keyword: #p
keyword: freq=noraman
keyword: PBEPBE/SDD
title: #p freq=noraman PBEPBE/SDD
converged: YES YES NO NO
title: Mulliken charges:
elementType: S S O O O O O O N C C C C C C C C C C C C C H H H H H H H H H H H H H H H H H H H H H H H H H H H H H
charge: 1.040039 1.038698 -0.415784 -0.414817 -0.522322 -0.530377 -0.523111 -0.529460 -0.275079 -0.362500 -0.391913 -0.373357 -0.374876 -0.382229 -0.352759 -0.274272 -0.397675 -0.254412 -0.513513 -0.512700 -0.631719 -0.631522 0.191962 0.193632 0.181647 0.220117 0.199381 0.194749 0.179255 0.210217 0.216704 0.214875 0.209376 0.177537 0.239400 0.232989 0.219517 0.204864 0.238052 0.228811 0.216596 0.279854 0.282517 0.280993 0.282273 0.249706 0.257920 0.237340 0.250441 0.257043 0.237891
chargesum: 0.00000
title: Mulliken charges with hydrogens summed into heavy atoms:
elementType: S S O O O O O O N C C C C C C C C C C C C C
charge: 1.040039 1.038698 -0.415784 -0.414817 -0.522322 -0.530377 -0.523111 -0.529460 -0.035679 0.023094 0.009851 0.020773 0.014595 0.049350 0.034154 0.178234 0.045241 0.190995 0.048858 0.050566 0.113247 0.113853
polarizability: 3.61350908e+02 -1.00757908e+01 1.91460903e+02 -3.31618497e-01 1.24807933e+00 1.83313053e+02
1716.lowfreq: -8.5010 -0.0018 -0.0016 -0.0014 0.5377 2.4748 8.7452 9.8706 13.9556
frequency: 4.3388 8.7810 13.9396 14.5514 23.4162 24.4200 36.9218 38.2483 45.7360 50.6483 63.4090 67.9421 87.4889 88.6755 93.5221 100.8884 123.8180 128.4952 140.4470 149.0175 155.5482 168.3883 182.3427 183.0949 185.7748 226.0472 236.9651 240.2893 242.9591 287.4249 290.2267 296.0055 307.7508 338.2138 346.7186 377.8079 384.6283 439.5022 447.0155 485.0833 502.9443 556.4123 558.2031 576.0867 579.9427 678.8355 733.9256 759.2516 782.7968 783.2164 783.7210 808.0690 837.8148 838.4949 880.2539 891.3767 918.3285 924.3381 936.2412 936.4737 978.0751 978.1464 981.3836 999.2926 1002.4364 1034.7829 1045.2733 1067.2187 1068.5342 1069.1658 1070.9371 1072.3552 1078.8239 1080.0295 1096.6078 1107.6127 1147.5791 1150.8545 1157.3508 1197.5262 1221.4790 1229.1795 1233.3830 1234.5563 1258.1964 1264.8606 1265.0980 1265.7032 1270.2837 1276.3187 1278.2183 1285.9890 1292.2670 1294.4131 1325.6777 1349.3989 1357.6988 1364.1260 1365.6314 1393.6762 1399.6144 1400.8672 1419.3599 1419.8847 1456.0997 1463.0386 1464.6148 1465.2523 1467.3293 1470.6346 1472.2100 1480.8111 1482.1729 1482.3843 1484.6231 1490.3176 1492.7496 1499.8579 2841.6919 2850.0105 2956.7465 2960.0570 2968.4271 2976.5014 2977.4754 2992.8361 2994.0904 2995.3821 2995.7656 2996.8941 2998.5002 3005.1435 3020.3457 3036.8530 3039.3744 3046.0802 3062.3854 3062.9212 3070.0710 3080.2405 3089.5873 3090.1649 3105.7042 3106.2407 3155.6052 3156.2715 3420.9773
redmass: 7.3210 4.4154 4.9182 6.1040 4.3967 3.1372 4.3860 2.0810 2.6155 3.8758 2.1093 3.9696 8.1027 2.2464 2.4821 4.2632 1.9853 2.5515 4.4620 2.0489 2.3910 6.0930 1.7171 1.6988 4.0782 4.0865 3.5308 2.0760 2.4099 4.3246 4.3963 4.5513 5.1725 8.0430 7.9750 4.4781 4.5835 3.9824 5.2478 3.9586 3.6610 7.0950 6.6277 10.3418 8.4596 1.3098 1.0689 1.0969 1.1725 1.0785 1.1757 1.1523 12.5855 12.7141 1.1931 1.2462 7.9574 7.5756 4.6441 4.6686 1.6637 1.6606 1.4215 2.6174 4.6020 3.6905 3.3339 2.0377 1.8130 1.6083 2.5625 2.4295 2.3703 2.5480 1.7095 2.4486 3.8075 1.4827 1.2609 1.5093 1.3173 1.3278 1.2369 1.2363 1.2504 1.2403 1.2537 1.1909 1.1863 1.1150 1.0936 1.1711 1.2030 1.1212 1.3055 1.3559 1.5866 1.3282 1.3966 1.4722 1.1772 1.1768 1.1109 1.1095 1.2059 1.0352 1.0350 1.0739 1.0669 1.0774 1.0794 1.0905 1.0519 1.0522 1.0861 1.0903 1.0952 1.0847 1.0715 1.0712 1.0616 1.0615 1.0603 1.0549 1.0551 1.0828 1.0787 1.0364 1.0364 1.0603 1.0955 1.0712 1.1010 1.1058 1.1058 1.1039 1.0590 1.0590 1.1071 1.1034 1.0960 1.0961 1.1020 1.1021 1.1099 1.1099 1.0739
irintensity: 5.2384 1.9495 1.7517 0.0970 2.6605 0.0693 0.0511 1.0546 0.3058 0.9671 6.7360 6.2942 0.0344 0.8103 0.4105 0.4147 1.6751 0.3277 6.3541 4.0474 2.7960 7.8899 0.1076 0.1067 0.9260 43.5387 3.0457 0.7789 2.3648 0.4966 5.4176 16.8856 1.1517 1.8198 36.5573 5.1800 6.6419 10.6696 0.7339 55.9705 7.2736 22.8043 6.9276 28.2534 201.8047 85.2467 11.9967 0.4511 3.7367 4.0265 3.1390 2.5044 104.5987 65.5763 0.2869 3.3290 100.0696 80.2548 50.7397 120.8350 10.0887 45.4034 1.2546 10.2947 0.8674 4.2048 14.5120 6.8235 17.1960 9.2152 5.7198 2.7334 0.4751 1.2960 24.1625 19.9943 72.8738 1.6844 4.8633 4.5357 2.5333 35.5275 2.0784 2.1577 2.3772 7.1363 16.3895 4.2306 0.0675 1.7895 1.2292 1.1286 2.2778 0.3450 5.6518 14.2440 0.1381 0.8389 46.2864 1.8631 28.7472 28.3657 3.5011 3.6321 38.8652 20.3234 20.2689 2.3851 1.1222 2.3264 2.1238 19.6769 11.0029 13.0092 7.6908 16.6531 9.2608 9.3055 39.7208 176.0994 2.1046 7.9765 55.2935 37.1337 40.3129 16.0474 18.0376 11.7019 11.4320 47.1125 6.0149 52.1432 3.7354 9.1258 9.1254 61.5331 2.9497 2.9010 90.5365 43.8105 8.3695 8.3122 6.7731 6.8188 2.2609 2.1633 1.5899
temp: 298.150 k
press: 1.00000 atm
elementType: 16 16 8 8 8 8 8 8 7 6 6 6 6 6 6 6 6 6 6 6 6 6 1 1 1 1 1 1 1 1 1 1 1 1 1 1 1 1 1 1 1 1 1 1 1 1 1 1 1 1 1
symmnumber: 1
zpe: 1100370.2 jmol-1
zpe.correction: 0.419109 hartree
zpe.thermalcorrener: 0.449924 hartree
zpe.thermalcorrenthalpy: 0.450868 hartree
zpe.thermalcorrgfe: 0.346118 hartree
zpe.sumelectzpe: -1812.811895 hartree
zpe.sumelectthermal: -1812.781080 hartree
zpe.sumelectthermalent: -1812.780136 hartree
zpe.sumelectthermalfe: -1812.884886 hartree
dipole: 0.3679 -0.5022 -0.6691
dipole: 0.9139
quadrupole: -142.5052 -154.1876 -160.2566
quadrupole: -72.9175 -6.2629 1.5644
quadrupole: 9.8113 -1.8711 -7.9401 -72.9175 -6.2629 1.5644
hfenergy: -1813.2310043 hartree
pointgroup: C01 [X(C13H29N1O6S2)]
dipole: 0.145965 0.208574 0.2539254 debye
polarizability: 361.4540464|9.1694911|191.4542395|-0.1858261|0.8700032|183.2165786 unknown
InChI: InChI=1S/C13H29NO6S2/c1-3-21(15,16)19-12-8-6-5-7-10-14-11-9-13-20-22(17,18)4-2/h14H,3-13H2,1-2H3
charge 0 multiplicity 1
51 atoms
S  8.477188 -0.539175 -0.01634
S  -8.511637 0.276786 0.001491
O  6.85971 0.388689 -0.190855
O  -6.795982 -0.464607 -0.137998
O  8.932922 -1.168577 -1.438027
O  8.396655 -1.504043 1.286425
O  -8.989501 0.871303 -1.428189
O  -8.57734 1.227816 1.314707
N  -1.930584 -0.098452 -0.223047
C  1.884496 0.569163 -0.163317
C  0.555658 -0.218383 -0.190385
C  3.125249 -0.351895 -0.175851
C  -0.683941 0.696933 -0.172809
C  4.453915 0.442843 -0.164697
C  -3.17657 0.692772 -0.179949
C  5.668114 -0.496292 -0.176736
C  -4.405876 -0.243225 -0.160472
C  -5.717226 0.553581 -0.127984
C  9.497277 1.057056 0.361801
C  -9.358975 -1.427086 0.334458
C  10.984975 0.721673 0.350988
C  -10.873681 -1.249448 0.325234
H  1.927783 1.254079 -1.035522
H  1.913848 1.211575 0.741087
H  0.528795 -0.855054 -1.100741
H  0.499446 -0.904919 0.676353
H  3.088272 -1.028427 0.702441
H  3.089451 -1.001272 -1.074855
H  -0.608156 1.436969 -1.011365
H  -0.693166 1.285672 0.766558
H  4.502173 1.107972 -1.047856
H  4.502275 1.08677 0.734062
H  -3.160111 1.303203 0.745019
H  -3.268923 1.411477 -1.035221
H  -1.926422 -0.745817 -1.025071
H  5.688624 -1.134745 0.728131
H  5.666149 -1.1343 -1.081939
H  -4.401555 -0.888624 -1.060759
H  -4.343491 -0.904259 0.721653
H  -5.79185 1.167105 0.791074
H  -5.810608 1.205749 -1.018526
H  9.097843 1.3732 1.337112
H  9.17775 1.742825 -0.437699
H  -8.930924 -1.724301 1.303555
H  -8.967048 -2.054716 -0.480375
H  11.244696 -0.010813 1.134197
H  11.300192 0.323099 -0.628278
H  11.558065 1.647027 0.54517
H  -11.210076 -0.568233 1.125315
H  -11.227768 -0.86227 -0.645281
H  -11.346209 -2.234601 0.494211
