program: Gaussian 09
title: 000005357
version: EM64L-G09RevD.01
frameworkgroup: C1[X(C17H26N2O4S)]
method: RPBEPBE
basis: SDD
operation: Freq
keyword: #p
keyword: freq=noraman
keyword: PBEPBE/SDD
title: #p freq=noraman PBEPBE/SDD
converged: YES YES NO NO
title: Mulliken charges:
elementType: S O O O O N N C C C C C C C C C C C C C C C C C H H H H H H H H H H H H H H H H H H H H H H H H H H
charge: 0.892569 -0.271618 -0.254358 -0.554873 -0.562371 -0.126626 -0.348421 0.008993 -0.475516 -0.467833 -0.364505 -0.463508 -0.328479 -0.695525 0.155439 0.175128 -0.401358 -0.097764 0.189480 -0.237550 -0.339790 -0.506946 -0.635819 -0.529418 0.229279 0.216016 0.204164 0.221648 0.224763 0.231114 0.176303 0.242494 0.258724 0.180034 0.228799 0.311838 0.212944 0.226685 0.218567 0.315190 0.286506 0.255375 0.257765 0.266930 0.227958 0.259067 0.254743 0.288795 0.233212 0.211758
chargesum: 0.00000
title: Mulliken charges with hydrogens summed into heavy atoms:
elementType: S O O O O N N C C C C C C C C C C C C C C C C C
charge: 0.892569 -0.271618 -0.254358 -0.554873 -0.562371 -0.126626 -0.036583 0.238272 -0.055336 -0.021422 0.042911 0.037710 0.080353 -0.037329 0.155439 0.175128 -0.086168 -0.097764 0.189480 0.048956 -0.072859 0.006194 0.105949 0.204346
polarizability: 3.20117402e+02 1.71494437e+01 2.44871360e+02 -7.55945294e+00 3.64126729e+00 1.76140386e+02
1716.lowfreq: -6.9690 -3.5428 -2.0320 -0.0017 -0.0014 -0.0012 11.2908 18.2336 22.8713
frequency: 10.0571 18.0892 22.8593 31.4800 43.8312 47.3329 54.3394 66.2470 69.8966 77.0376 98.6799 129.7280 144.2572 155.1562 158.9086 186.7278 195.0398 208.4489 212.5721 221.6749 229.8652 245.9459 252.1143 257.0099 283.5832 285.7537 310.0234 324.5559 342.9642 351.3920 374.1984 390.8326 422.2044 453.7956 475.6373 485.6388 521.8461 528.2127 553.8538 566.7220 584.3687 603.5056 612.0223 647.4501 713.0542 743.7915 762.2615 780.9306 784.4303 791.2360 799.8925 818.0106 832.5222 841.5497 877.4368 899.2204 908.2743 930.7373 932.8993 958.7256 968.8081 971.3909 973.3002 975.1031 1009.7088 1011.8106 1039.2555 1066.5566 1071.9488 1073.2742 1091.3984 1096.1761 1105.3933 1116.1935 1121.0164 1145.6537 1149.8847 1157.9149 1162.6813 1191.0307 1204.5400 1221.6803 1233.3025 1235.9193 1242.3345 1246.1842 1250.6502 1260.8565 1276.9981 1290.7479 1295.9474 1310.1443 1336.6227 1342.3254 1354.9093 1373.2891 1377.1869 1388.3295 1389.3743 1394.5614 1410.6443 1429.2137 1435.2209 1453.4082 1461.8600 1463.6788 1464.7379 1467.1711 1469.9760 1472.7086 1473.7597 1481.4966 1482.6180 1487.5178 1497.5393 1558.1864 1588.9641 1601.5312 2835.9238 2846.5495 2900.3785 2979.4348 2984.8214 2992.3811 2996.7356 3013.1834 3020.0003 3021.6115 3037.2170 3043.2381 3051.6284 3079.6305 3084.8230 3087.1053 3090.7940 3091.3288 3091.9452 3102.1284 3132.4311 3132.8959 3137.8975 3152.8794 3177.2517 3555.7760
redmass: 3.7708 4.0715 5.9048 3.8575 2.8096 3.5885 3.0156 3.0585 3.9875 3.2809 4.3291 4.3033 5.2837 7.0978 2.1668 1.4337 2.8982 2.9397 2.1853 3.8490 2.1532 2.1114 1.8457 1.9666 2.4078 3.5855 5.3297 4.8099 2.4407 5.8227 3.5274 5.0395 2.9765 4.2791 4.1495 3.8092 5.6170 3.9964 1.5603 2.0670 3.6399 2.5795 5.4262 6.4037 5.3242 4.4617 4.9161 1.2642 6.0206 1.2248 3.2653 1.8512 3.4202 1.5236 2.3211 2.0315 4.9594 1.5874 1.8927 2.1196 2.3821 1.5672 2.6003 1.8391 2.2515 2.1231 1.4075 2.6770 2.1841 2.1100 2.1324 1.9999 2.0724 1.3080 2.0012 1.6018 1.8412 1.3387 1.5096 2.0979 2.5229 1.2954 3.1728 1.2569 1.5573 1.2679 1.5115 1.6501 1.2503 1.2644 1.3243 1.3175 1.3688 1.3881 1.4102 3.1217 1.4233 1.6915 2.7402 1.1638 1.1299 1.4793 1.1851 1.0796 1.0343 1.0914 1.7218 1.0499 1.0739 1.1200 1.0882 1.7522 1.0533 1.0822 1.0924 6.3746 7.3514 6.9967 1.0719 1.0711 1.0834 1.0339 1.0356 1.0361 1.0599 1.0646 1.0603 1.0877 1.0879 1.0568 1.1018 1.0990 1.1047 1.0975 1.1005 1.1043 1.0985 1.1019 1.1051 1.0917 1.1097 1.0893 1.0964 1.0778
irintensity: 0.2024 0.3127 4.3286 0.0632 0.5429 0.0983 1.0929 1.4238 3.3566 2.2015 2.1611 2.2734 10.0493 2.5055 2.4208 0.1293 0.7212 7.5431 2.0807 18.5657 4.3563 5.1354 2.9608 1.1875 3.2329 0.8490 2.6648 9.2793 6.9165 10.8901 2.2282 2.0296 22.8237 46.2203 2.1118 10.2181 55.5860 36.2365 43.8817 41.0346 49.4719 7.9819 2.5610 7.5496 1.0604 2.1394 5.8587 5.3612 57.4326 2.0926 40.4404 0.1747 12.0541 32.8270 1.4989 2.9057 81.9431 14.1977 2.5916 2.6695 12.0441 3.9497 12.9519 37.3824 2.2843 0.3787 6.5948 17.5329 61.5726 13.7606 3.3390 15.3402 16.1206 4.9756 3.2050 31.8375 22.3643 2.7448 13.2422 14.0273 36.4292 2.6045 122.9200 0.2783 6.1199 15.4782 59.3635 193.1753 19.6722 17.8560 4.5373 1.6474 5.9271 2.3330 12.8958 56.6705 5.8656 14.3613 10.6060 31.5341 1.6163 23.5545 31.1379 45.2262 19.3706 6.8335 83.1187 17.6508 61.4163 20.5603 18.2707 194.7490 15.3803 3.8472 4.0914 26.2142 117.7489 86.9136 61.9716 163.9988 61.4379 56.6188 32.8244 19.0823 44.6429 27.7399 27.5896 19.6695 50.5153 10.4624 26.7558 49.5932 48.1497 9.0392 42.7345 10.9794 26.6235 3.2052 17.5709 3.5877 7.5590 1.1787 3.3678 16.0801
temp: 298.150 k
press: 1.00000 atm
elementType: 16 8 8 8 8 7 7 6 6 6 6 6 6 6 6 6 6 6 6 6 6 6 6 6 1 1 1 1 1 1 1 1 1 1 1 1 1 1 1 1 1 1 1 1 1 1 1 1 1 1
symmnumber: 1
zpe: 1073621.3 jmol-1
zpe.correction: 0.408921 hartree
zpe.thermalcorrener: 0.435814 hartree
zpe.thermalcorrenthalpy: 0.436758 hartree
zpe.thermalcorrgfe: 0.347535 hartree
zpe.sumelectzpe: -1469.835333 hartree
zpe.sumelectthermal: -1469.808440 hartree
zpe.sumelectthermalent: -1469.807496 hartree
zpe.sumelectthermalfe: -1469.896719 hartree
dipole: 4.0485 -1.1435 8.0073
dipole: 9.0451
quadrupole: -156.3089 -150.0461 -158.5063
quadrupole: 0.9507 -18.4443 -3.2520
quadrupole: -1.3552 4.9077 -3.5525 0.9507 -18.4443 -3.2520
hfenergy: -1470.2442541 hartree
pointgroup: C01 [X(C17H26N2O4S1)]
dipole: 1.4937891 -0.4055762 3.2043687 debye
polarizability: 317.7555618|22.1265454|247.4278664|-1.6906693|5.507148|175.9457186 unknown
InChI: InChI=1S/C17H26N2O4S/c1-4-19-10-6-7-13(19)12-18-17(20)15-11-14(24(21,22)5-2)8-9-16(15)23-3/h8-9,11,13,18H,4-7,10,12H2,1-3H3
charge 0 multiplicity 1
50 atoms
S  -4.411163 -1.339007 -0.740958
O  1.13052 1.600984 -1.096315
O  -0.850255 3.275048 0.907793
O  -5.813814 -0.684117 -1.280602
O  -3.527038 -2.385481 -1.644802
N  4.801916 -0.657943 -0.002931
N  1.005392 -0.484232 -0.073713
C  3.444753 -0.449008 0.584212
C  3.429594 -1.29836 1.892369
C  4.682625 -2.20923 1.780257
C  5.670492 -1.317514 1.002386
C  2.373806 -0.873799 -0.457933
C  5.372208 0.515513 -0.697613
C  6.571281 0.151788 -1.592602
C  0.465329 0.737703 -0.437126
C  -0.984955 0.935899 -0.060673
C  -1.887899 -0.115542 -0.385836
C  -3.264288 0.069156 -0.232437
C  -1.534515 2.159043 0.448343
C  -3.827371 1.287368 0.193807
C  -2.948436 2.322539 0.5404
C  -4.84502 -2.267274 0.920046
C  -5.837477 -3.378204 0.593485
C  0.590904 3.265754 1.212547
H  3.267277 0.62599 0.820861
H  3.520363 -0.640228 2.775888
H  2.494857 -1.877584 2.009225
H  4.456323 -3.115521 1.189928
H  5.074144 -2.523402 2.762868
H  6.473535 -1.897705 0.514359
H  6.153494 -0.578397 1.692807
H  2.415609 -1.968069 -0.603156
H  2.600569 -0.387592 -1.421865
H  5.682367 1.305862 0.03558
H  4.575172 0.960423 -1.322557
H  0.456728 -1.11044 0.517133
H  6.925528 1.043306 -2.141596
H  6.279617 -0.620613 -2.325825
H  7.419828 -0.236923 -1.000927
H  -1.522984 -1.046546 -0.836404
H  -4.913351 1.42163 0.228232
H  -3.867658 -2.621958 1.28434
H  -5.25243 -1.474654 1.568202
H  -3.319123 3.285571 0.902675
H  -6.117425 -3.907649 1.522892
H  -6.754893 -2.9646 0.140494
H  -5.397704 -4.111208 -0.104388
H  1.180461 3.32781 0.284875
H  0.739072 4.15258 1.846889
H  0.869835 2.351032 1.769967
