program: Gaussian 09
title: 000043709
version: EM64L-G09RevD.01
frameworkgroup: C1[X(C19H20ClNO4)]
method: RPBEPBE
basis: SDD
operation: Freq
keyword: #p
keyword: freq=noraman
keyword: PBEPBE/SDD
title: #p freq=noraman PBEPBE/SDD
converged: YES YES NO NO
title: Mulliken charges:
elementType: Cl O O O O N C C C C C C C C C C C C C C C C C C C H H H H H H H H H H H H H H H H H H H H
charge: -0.066748 -0.264260 -0.276560 -0.413789 -0.229657 -0.376741 -0.570954 0.524588 -0.364383 0.495153 -0.565422 -0.372469 -0.447103 -0.419939 -0.419780 -0.481629 0.184968 0.176388 0.176599 0.184658 -0.333763 -0.346421 -0.124113 -0.202292 -0.533989 0.223206 0.211434 0.225672 0.256718 0.233243 0.233682 0.230811 0.229753 0.235659 0.235930 0.260375 0.263917 0.312685 0.275602 0.260383 0.258912 0.378734 0.280836 0.228707 0.231398
chargesum: 0.00000
title: Mulliken charges with hydrogens summed into heavy atoms:
elementType: Cl O O O O N C C C C C C C C C C C C C C C C C C C
charge: -0.066748 -0.264260 -0.276560 -0.035055 -0.229657 -0.064056 -0.136313 0.524588 0.118007 0.495153 -0.098497 -0.141657 -0.217350 -0.184281 -0.183850 0.042663 0.184968 0.176388 0.176599 0.184658 -0.058160 -0.086038 -0.124113 0.056619 0.206952
polarizability: 2.94354250e+02 2.04007651e+01 2.38295936e+02 -2.64357096e+01 4.23008124e+00 1.65756381e+02
1716.lowfreq: -9.0265 -7.9967 -0.9066 -0.0021 -0.0021 -0.0014 11.5783 16.6851 23.4621
frequency: 11.4180 16.1992 23.1472 25.7193 33.6793 37.0589 52.6728 61.1024 76.5865 85.0717 107.4420 128.9815 138.9960 152.8930 188.6158 191.7090 199.3293 241.9553 260.5744 283.7889 290.0100 311.5695 321.4720 348.1777 350.4893 372.4498 384.8674 403.3263 420.8924 453.3428 476.9457 497.5557 507.3702 517.3313 550.1129 562.1008 574.7795 594.3214 616.7827 637.7936 638.4393 646.7574 710.1224 717.0620 739.9451 750.1188 759.3379 779.8608 810.6387 820.9016 824.9118 846.3520 850.0496 872.9113 888.2705 896.6582 945.7222 955.3898 962.7765 972.5501 973.4747 1000.5996 1012.7441 1021.0751 1029.3458 1044.1517 1077.1275 1085.9498 1105.0408 1115.2057 1121.4536 1146.9979 1155.4432 1159.3439 1193.5398 1198.4786 1211.9965 1222.2934 1227.9409 1238.7461 1239.6620 1248.3686 1258.8022 1269.6971 1302.4466 1312.8519 1340.0739 1357.4624 1366.0615 1372.3512 1379.2269 1382.2102 1411.1799 1430.9570 1440.4128 1455.6221 1460.6346 1467.2029 1468.6241 1472.6920 1475.7876 1487.8241 1509.4257 1560.7821 1582.9125 1590.4097 1605.3564 1624.5559 1667.4747 2971.3807 2980.3214 2986.5929 2996.0239 3010.0544 3026.8902 3042.5832 3072.8106 3074.8203 3091.3423 3110.0429 3113.0423 3127.6256 3132.5949 3140.2239 3154.7032 3160.6895 3180.6761 3513.0830 3543.7124
redmass: 9.0854 6.5291 6.4214 7.9054 4.0210 5.5974 5.9086 4.3464 3.8289 2.4359 6.1307 5.4293 5.4051 4.2173 7.2949 5.8640 2.0826 2.4152 3.7121 2.5503 2.6729 3.7528 4.3653 5.8456 8.9850 2.4669 4.0731 2.8422 4.2459 4.1428 3.8073 3.1631 1.7476 3.8940 3.3768 3.7823 1.3472 3.0374 5.6643 6.6877 1.3383 6.4467 3.6286 5.6952 3.4960 5.1378 5.2609 1.3647 2.8109 2.1833 1.4935 4.0637 1.2536 2.3093 2.1350 1.9187 1.9222 1.3377 1.6636 1.4622 6.4105 1.8593 3.0060 3.5677 3.7971 1.9550 2.4945 2.0839 1.9240 1.3333 1.4219 1.7167 1.1796 1.3044 1.1405 1.3930 3.1003 2.0923 3.3395 1.3822 1.2768 1.9521 1.5342 1.1766 1.7681 1.3351 1.3601 1.4548 1.8105 3.0266 6.5460 5.1829 2.5297 1.4386 1.0971 1.0819 1.2922 1.3124 1.3939 1.0620 1.0991 1.6572 2.6875 7.0366 6.4744 6.9869 6.9272 6.4612 8.3061 1.0611 1.0333 1.0657 1.0609 1.0601 1.1012 1.0990 1.1029 1.0959 1.0992 1.0870 1.0874 1.1051 1.0961 1.0968 1.0919 1.0883 1.0978 1.0640 1.0775
irintensity: 0.4109 1.0970 0.2656 0.4018 0.1744 0.8692 1.7857 0.7090 1.8741 0.1676 2.4433 2.1980 6.4695 4.5313 2.9623 1.4765 3.0453 0.8434 0.5927 8.2995 0.0322 0.7175 8.0890 4.4489 1.8630 0.9196 8.8336 0.1699 5.0516 10.5166 4.0781 32.0232 29.6619 11.9252 17.6218 41.7631 117.9641 30.7293 16.8533 1.0126 124.0378 4.2464 1.4473 6.0583 0.5003 2.5460 5.0862 7.8041 9.6556 38.9980 51.4236 18.5680 0.2517 10.4647 15.3633 7.0152 4.0047 0.9402 0.6786 2.1694 28.8221 3.7812 6.6544 176.1186 21.5996 14.5809 95.6193 19.6594 19.6141 6.8599 7.6573 1.2067 4.7600 3.0713 3.9539 7.7010 10.1549 0.8046 107.1956 16.1444 62.8950 64.7131 122.6607 0.3102 51.0712 6.8330 4.2506 6.6743 39.6468 58.0891 0.7087 0.3165 4.8234 9.4517 65.6851 54.9751 123.3727 40.0065 95.7313 39.6106 10.4388 116.7403 31.7334 11.3131 0.4831 96.3444 44.5640 0.4963 237.8837 12.2492 55.3844 98.0651 4.4878 24.3547 20.1896 0.2745 16.2501 10.9554 23.8606 7.9081 19.9125 14.6509 32.2970 2.0302 0.7951 1.2589 3.4471 20.0087 16.8061
temp: 298.150 k
press: 1.00000 atm
elementType: 17 8 8 8 8 7 6 6 6 6 6 6 6 6 6 6 6 6 6 6 6 6 6 6 6 1 1 1 1 1 1 1 1 1 1 1 1 1 1 1 1 1 1 1 1
symmnumber: 1
zpe: 922372.5 jmol-1
zpe.correction: 0.351313 hartree
zpe.thermalcorrener: 0.376120 hartree
zpe.thermalcorrenthalpy: 0.377064 hartree
zpe.thermalcorrgfe: 0.291169 hartree
zpe.sumelectzpe: -1549.915601 hartree
zpe.sumelectthermal: -1549.890794 hartree
zpe.sumelectthermalent: -1549.889849 hartree
zpe.sumelectthermalfe: -1549.975745 hartree
dipole: -0.9291 1.7216 -2.2582
dipole: 2.9877
quadrupole: -178.4841 -134.8290 -157.5105
quadrupole: 10.7630 -9.2214 -0.0697
quadrupole: -21.5429 22.1122 -0.5693 10.7630 -9.2214 -0.0697
hfenergy: -1550.2669137 hartree
pointgroup: C01 [X(C19H20Cl1N1O4)]
dipole: 0.3657743 -0.649777 -0.9086933 debye
polarizability: 294.335265|19.0722257|238.1993746|27.8407247|-1.8735522|165.8719274 unknown
InChI: InChI=1S/C19H20ClNO4/c1-25-17-8-7-15(20)12-16(17)19(24)21-11-10-14-4-2-13(3-5-14)6-9-18(22)23/h2-5,7-8,12,21-22H,6,9-11H2,1H3
charge 0 multiplicity 1
45 atoms
Cl -6.645354 1.061103 -0.997659
O  -1.019423 2.190506 0.854412
O  -1.577393 -0.842842 2.096539
O  4.894821 3.513215 0.339028
O  6.411266 1.919748 -0.406934
N  -2.123748 -1.870022 0.075919
C  -0.414163 -3.62512 -0.5103
C  0.800364 -2.705933 -0.500237
C  -1.562384 -3.179617 0.434573
C  3.139135 -1.034442 -0.499325
C  4.372282 -0.142776 -0.495447
C  1.56042 -2.513049 0.682748
C  1.224461 -2.041285 -1.67755
C  2.708142 -1.693412 0.682111
C  2.374174 -1.218471 -1.677816
C  4.032969 1.303876 -0.061125
C  -2.101967 -0.782224 0.939323
C  -2.809941 0.445256 0.415678
C  -2.296863 1.778369 0.485198
C  5.24293 2.218124 -0.077163
C  -4.143208 0.256015 -0.055319
C  -3.136535 2.869204 0.122571
C  -4.937987 1.349901 -0.418338
C  -4.452243 2.670713 -0.323923
C  0.120463 1.261493 0.939386
H  -0.11892 -4.647387 -0.198345
H  -0.804437 -3.717506 -1.543028
H  -2.360878 -3.948159 0.422646
H  -1.203264 -3.083687 1.473466
H  5.141866 -0.546449 0.187562
H  4.832249 -0.113553 -1.499666
H  1.257656 -3.011933 1.611338
H  0.660806 -2.181857 -2.608528
H  3.287823 -1.575704 1.606464
H  2.689391 -0.728344 -2.607568
H  3.60225 1.321653 0.958451
H  3.261244 1.744104 -0.721662
H  -2.481746 -1.730527 -0.871073
H  -4.564377 -0.753871 -0.080085
H  -2.713461 3.875596 0.189552
H  -5.082769 3.520935 -0.598503
H  5.7035 4.094131 0.317805
H  0.067298 0.663017 1.862152
H  1.003134 1.918791 0.939252
H  0.154118 0.587117 0.062516
