program: Gaussian 09
title: 000045478
version: EM64L-G09RevD.01
frameworkgroup: C1[X(C17H18N2O2)]
method: RPBEPBE
basis: SDD
operation: Freq
keyword: #p
keyword: freq=noraman
keyword: PBEPBE/SDD
title: #p freq=noraman PBEPBE/SDD
converged: YES YES NO NO
title: Mulliken charges:
elementType: O O N N C C C C C C C C C C C C C C C C C H H H H H H H H H H H H H H H H H H
charge: -0.212102 -0.209015 -0.097052 0.017365 -0.369834 -0.116458 0.360214 -0.515675 0.254569 0.487594 -0.744208 -0.557392 -0.627773 -0.339462 0.395623 -0.353171 -0.467534 -0.411696 -0.229255 -0.225507 -0.248505 0.210975 0.236856 0.235274 0.212622 0.232674 0.227001 0.222270 0.297256 0.233633 0.191436 0.224148 0.243917 0.249814 0.228756 0.286177 0.223330 0.225169 0.227965
chargesum: 0.00000
title: Mulliken charges with hydrogens summed into heavy atoms:
elementType: O O N N C C C C C C C C C C C C C C C C C
charge: -0.212102 -0.209015 -0.097052 0.017365 -0.158859 0.120398 0.360214 -0.067779 0.254569 0.487594 -0.062263 -0.260136 0.021444 -0.095545 0.395623 -0.103356 -0.238778 -0.125519 -0.005925 -0.000338 -0.020540
polarizability: 2.35981612e+02 -1.85686070e+00 2.21001630e+02 -5.33554830e+00 2.01255207e+01 1.65435898e+02
1716.lowfreq: -13.0037 -6.4330 -2.1671 0.0002 0.0005 0.0007 17.8403 36.1066 44.2541
frequency: 17.5826 36.0739 44.2370 63.7011 82.4636 102.7139 139.4499 152.3506 185.3920 201.2767 206.5889 219.5491 244.6160 250.4904 292.0802 298.2625 314.0124 322.7728 397.6953 402.6950 434.1990 452.3035 475.9760 495.3557 515.3208 521.3035 573.3972 609.7928 617.8831 642.4073 689.4785 701.3920 707.2466 716.8817 746.5525 763.1725 783.1229 806.1977 826.5986 839.1743 846.5565 900.2191 910.4176 936.2831 948.6320 969.3952 971.3897 982.7397 990.6586 993.0075 1000.0984 1026.6684 1028.7900 1067.4611 1081.8266 1084.5483 1105.0499 1119.4555 1122.8534 1152.8455 1170.9398 1185.9239 1186.8928 1188.4412 1203.6933 1217.9921 1228.8338 1245.2805 1252.8428 1260.9554 1301.2606 1316.6647 1337.5793 1342.8811 1365.9667 1374.4644 1378.6171 1383.6093 1402.0026 1424.9424 1437.1674 1440.7991 1457.7648 1464.0198 1472.6885 1479.2293 1479.7029 1486.5853 1491.0522 1589.0911 1592.2910 1608.9053 1613.8146 2809.3697 2872.0211 2978.8965 2984.0153 2988.9956 3011.8188 3015.5262 3075.2394 3075.9803 3078.3042 3110.1283 3124.9115 3128.4979 3138.4098 3154.7958 3162.5644 3166.4728 3186.4286
redmass: 4.1606 5.2811 7.7742 5.5218 3.9568 3.4399 3.5691 3.9194 1.7199 1.7525 1.4203 2.3580 4.6756 2.7354 3.6931 3.5104 4.7613 3.6970 4.1082 2.7828 2.9547 3.2425 5.5040 3.6994 4.5133 5.9697 3.7620 5.5019 5.8581 6.7233 5.6989 1.6652 5.3926 3.8817 3.9079 2.0735 4.5347 2.8155 3.7093 1.3707 1.2632 3.0964 1.8327 1.8205 1.8186 1.6134 1.6101 1.4945 5.9473 1.3186 1.8988 2.1988 1.8658 2.1598 1.7379 2.0929 1.5170 1.5969 2.0268 1.7697 1.0611 1.9568 1.5718 1.4924 2.3667 5.0025 1.5519 2.0558 1.7803 1.5642 1.7151 1.3295 1.3473 1.5388 6.7874 1.4667 1.3256 5.4726 5.8033 2.9394 1.3196 2.1429 1.0762 1.0704 1.0595 1.6884 2.1949 1.3067 1.1394 7.3860 6.2784 6.2951 6.9840 1.0714 1.0557 1.0372 1.0809 1.0836 1.0860 1.0748 1.0993 1.0999 1.0997 1.0877 1.0863 1.0905 1.0924 1.0958 1.0919 1.0994 1.0946
irintensity: 0.1490 0.6001 0.0634 0.4328 0.3572 0.6974 0.9693 0.9356 0.3226 0.1797 0.3219 0.3770 1.9897 1.1641 3.6941 2.1227 2.1159 0.9399 3.0415 0.1646 3.3253 6.3297 0.6084 7.5491 0.9469 0.8355 21.3943 0.7551 2.5866 7.0958 6.3993 48.5278 13.6166 18.0482 12.8398 33.5908 0.8390 8.0659 1.6635 26.7638 0.0949 2.7765 8.0725 14.7292 4.0502 0.9306 0.7120 7.2600 0.0898 0.0783 3.8931 9.5846 18.5674 2.7585 7.9988 43.0395 12.7496 18.5316 33.7265 8.3064 0.1280 3.6728 3.3981 3.2193 73.3573 317.0406 8.9300 31.4846 1.0820 7.1482 7.8868 2.5629 3.1106 2.3763 92.3417 7.3345 24.9160 1.2597 9.0323 36.0139 13.9529 7.7365 37.3582 3.3909 11.6067 18.5049 18.1115 1.0633 9.7638 18.4239 8.4525 11.0863 5.6976 78.6850 167.3654 18.8656 26.1508 22.4690 22.1520 38.0892 28.4574 13.0967 51.1354 9.7153 0.1544 12.7150 26.9428 36.8906 1.5590 12.4549 2.2050
temp: 298.150 k
press: 1.00000 atm
elementType: 8 8 7 7 6 6 6 6 6 6 6 6 6 6 6 6 6 6 6 6 6 1 1 1 1 1 1 1 1 1 1 1 1 1 1 1 1 1 1
symmnumber: 1
zpe: 822886.8 jmol-1
zpe.correction: 0.313421 hartree
zpe.thermalcorrener: 0.331972 hartree
zpe.thermalcorrenthalpy: 0.332916 hartree
zpe.thermalcorrgfe: 0.265446 hartree
zpe.sumelectzpe: -916.959042 hartree
zpe.sumelectthermal: -916.940491 hartree
zpe.sumelectthermalent: -916.939547 hartree
zpe.sumelectthermalfe: -917.007017 hartree
dipole: -5.4281 -4.3903 -0.2967
dipole: 6.9876
quadrupole: -146.5976 -116.1088 -116.3928
quadrupole: -11.6329 -4.0002 2.3729
quadrupole: -20.2312 10.2576 9.9736 -11.6329 -4.0002 2.3729
hfenergy: -917.2724628 hartree
pointgroup: C01 [X(C17H18N2O2)]
dipole: 2.0125583 -1.8563959 0.2471921 debye
polarizability: 236.5778576|1.5637058|219.741783|-3.8085098|-21.1365293|166.0994989 unknown
InChI: InChI=1S/C17H18N2O2/c1-12-17(13-6-4-3-5-7-13)16-10-15(19(20)21)9-8-14(16)11-18(12)2/h3-10,12,17H,11H2,1-2H3
charge 0 multiplicity 1
39 atoms
O  -5.041504 0.944613 0.089481
O  -3.597053 2.157978 -1.191582
N  1.690019 -2.160617 0.437814
N  -3.873618 1.156797 -0.422847
C  0.928871 -0.247236 -0.942146
C  1.789348 -1.552006 -0.913735
C  -0.462981 -0.497909 -0.355993
C  0.345421 -2.647516 0.776514
C  -0.73621 -1.627416 0.463531
C  1.649453 0.931506 -0.274605
C  1.408841 -2.50364 -2.084583
C  -1.506672 0.413741 -0.638072
C  2.755908 -3.11723 0.775426
C  -2.043678 -1.825636 0.97963
C  -2.792456 0.192848 -0.111185
C  1.793842 1.017444 1.134458
C  2.218541 1.950787 -1.080164
C  -3.084207 -0.924243 0.704642
C  2.498382 2.092976 1.718991
C  2.921396 3.02981 -0.497239
C  3.064268 3.103807 0.90699
H  0.795364 0.023154 -2.009365
H  2.84689 -1.252887 -1.041648
H  0.322322 -2.885431 1.85882
H  0.087691 -3.606074 0.249844
H  0.328208 -2.736304 -2.090815
H  1.655652 -2.034379 -3.054318
H  1.967471 -3.455576 -2.02311
H  -1.329178 1.297663 -1.25834
H  3.739666 -2.656651 0.578008
H  2.702481 -4.079181 0.207907
H  2.706529 -3.361982 1.85263
H  -2.24257 -2.701198 1.60908
H  1.364876 0.232013 1.764025
H  2.107655 1.902019 -2.171315
H  -4.094864 -1.059834 1.097144
H  2.602412 2.146424 2.808871
H  3.350155 3.811168 -1.134962
H  3.604127 3.941296 1.36312
