program: Gaussian 09
title: 000045502
version: EM64L-G09RevD.01
frameworkgroup: C1[X(C20H22Cl3NO2)]
method: RPBEPBE
basis: SDD
operation: Freq
keyword: #p
keyword: freq=noraman
keyword: PBEPBE/SDD
title: #p freq=noraman PBEPBE/SDD
converged: YES YES NO NO
title: Mulliken charges:
elementType: Cl Cl Cl O O N C C C C C C C C C C C C C C C C C C C C H H H H H H H H H H H H H H H H H H H H H H
charge: -0.015786 -0.015509 0.035284 -0.299873 -0.300545 -0.132550 -0.146280 0.335918 -0.465455 -0.403380 -0.557402 0.362278 -0.560892 -0.561783 -0.639296 -0.583770 0.174093 0.203659 0.579936 -0.419414 -0.423707 -0.050501 -0.052042 -0.115503 -0.530154 -0.530848 0.209474 0.228719 0.222660 0.216361 0.196835 0.232165 0.217743 0.239976 0.229206 0.260028 0.224639 0.197675 0.229344 0.260139 0.269953 0.267550 0.230724 0.219220 0.255080 0.221949 0.254056 0.230024
chargesum: 0.00000
title: Mulliken charges with hydrogens summed into heavy atoms:
elementType: Cl Cl Cl O O N C C C C C C C C C C C C C C C C C C C C
charge: -0.015786 -0.015509 0.035284 -0.299873 -0.300545 -0.132550 0.063193 0.335918 -0.014076 0.009817 -0.107494 0.362278 -0.091709 -0.301755 0.012362 -0.323631 0.174093 0.203659 0.579936 -0.149461 -0.156157 -0.050501 -0.052042 -0.115503 0.174870 0.175181
polarizability: 3.24050172e+02 1.88158237e+01 3.04373388e+02 2.04418204e+01 -1.13969940e+01 1.63956245e+02
1716.lowfreq: -5.8544 -0.0018 -0.0008 -0.0006 1.7252 6.5379 9.4332 16.4923 24.6676
frequency: 8.5074 13.7622 24.5212 37.4040 50.6782 65.0679 75.1701 82.0828 91.4512 105.8954 138.0169 157.8928 159.7497 167.1483 182.6245 191.2040 194.0128 195.2373 198.2105 206.8732 235.5830 243.0631 250.9896 278.0861 303.5986 320.1181 325.1911 332.6010 338.4396 355.1523 393.1688 408.9545 416.4389 439.2467 459.9489 492.2962 499.3459 500.6893 511.7835 527.7494 566.1255 590.9061 632.2741 663.8884 691.4190 702.6732 709.2772 715.3395 741.7684 752.5556 765.6095 770.9320 824.0108 862.7934 887.0974 891.5643 897.3827 901.1205 905.9731 912.9990 954.1052 967.3726 983.5797 1006.1948 1017.5333 1036.5843 1063.5606 1072.5323 1080.6797 1109.3812 1113.5351 1115.6093 1121.4948 1141.4807 1143.7989 1150.3219 1158.4643 1168.9500 1185.9877 1192.0796 1199.5742 1209.5444 1224.5401 1228.1216 1245.4375 1267.8273 1272.2857 1286.6117 1293.0228 1316.4528 1332.7059 1347.1477 1358.4133 1370.4576 1374.7168 1382.2636 1395.1980 1425.1244 1427.9100 1434.5310 1444.5456 1447.2722 1457.8406 1459.4263 1464.6421 1473.8108 1477.6169 1479.5246 1484.7664 1487.4794 1489.7270 1491.1306 1552.1420 1572.7385 1587.1990 1618.5164 2826.0473 2853.8592 2867.6633 2969.9633 2971.7645 2979.4539 2992.6284 2999.6011 3026.5545 3028.0025 3038.8162 3041.6498 3065.2459 3066.2880 3068.2782 3083.7487 3120.4287 3121.5027 3137.4375 3142.5119 3155.5668 3158.4440
redmass: 9.4775 7.5716 4.2679 5.1454 8.5481 3.4328 3.2857 13.7630 4.4384 2.7256 2.6872 1.5754 1.1229 1.9819 3.2978 4.6220 5.3140 11.8816 2.3178 2.2916 2.9353 3.0930 3.4355 4.0464 3.6291 4.3839 5.1340 5.5659 3.6126 4.2920 3.4129 5.1800 5.6952 5.6405 3.0991 4.8139 5.2832 3.5147 5.3321 4.5896 3.9324 5.5341 4.8111 6.4208 4.5868 3.9175 3.2862 5.6753 3.0731 7.1328 1.8556 3.4506 1.9723 1.8362 1.6368 1.3635 2.1464 1.7762 3.2508 3.5768 6.2487 2.6561 2.3575 5.7624 1.9401 2.1966 2.6035 1.9119 3.7335 1.4147 1.2421 1.2429 2.2668 1.4771 1.8177 1.3560 1.4800 1.3950 1.7310 1.5812 2.0147 1.3985 1.8183 2.3420 1.6866 1.3514 2.8759 1.6032 1.5497 1.5715 1.6917 1.4390 6.4552 2.9907 1.8628 2.7999 2.6841 1.1733 3.8185 1.1830 1.2015 1.2749 1.0580 1.0626 1.0681 1.0593 1.0558 1.0849 1.1323 1.0555 1.3756 1.8402 8.0673 8.4712 7.1884 7.1878 1.0808 1.0682 1.0598 1.0310 1.0314 1.0615 1.0595 1.0594 1.0876 1.0738 1.0997 1.0996 1.1042 1.1038 1.1034 1.1000 1.1027 1.1028 1.0908 1.0918 1.0921 1.0932
irintensity: 0.0203 0.1142 0.0782 0.1497 0.1364 0.2567 4.0202 0.2326 0.2307 7.5094 4.6949 1.1133 0.2331 1.0534 0.6192 1.4264 0.0724 0.0788 1.3203 0.9682 2.5794 6.3922 4.0374 6.8978 1.7592 4.6444 1.8329 2.4423 0.3867 1.0632 0.7461 3.1874 3.6006 20.8027 9.5791 0.6940 1.7287 6.2930 0.0243 0.5373 5.4290 5.7049 14.6209 2.0245 6.7865 5.4376 2.6069 7.9418 3.5338 58.8276 36.8855 2.7814 4.0408 17.1767 6.7622 0.5129 9.3386 34.5267 13.7772 11.1472 86.7504 18.3032 11.2477 6.6415 2.6322 24.1654 6.3291 9.6407 45.4742 7.9015 17.2354 2.6358 25.5489 16.2307 44.7015 4.2859 20.4507 13.6735 16.7533 9.5210 17.1955 22.2551 47.1004 0.7979 12.0677 19.2836 79.0083 32.1498 9.7682 13.5798 22.4329 13.1031 8.0847 3.0400 27.1323 54.9476 7.9546 0.0193 69.6055 9.8602 10.9695 13.9073 12.6539 6.5163 2.9307 13.3914 4.9422 9.6267 9.6540 13.5156 75.8302 107.7435 62.2203 0.6387 46.0429 1.2991 44.2646 57.6585 226.9891 95.3580 55.6188 21.8328 4.8707 39.8277 39.7421 53.9503 15.4587 35.6867 37.8299 30.9562 23.7557 32.6268 24.9635 24.3147 9.1608 2.5756 0.4992 1.9290
temp: 298.150 k
press: 1.00000 atm
elementType: 17 17 17 8 8 7 6 6 6 6 6 6 6 6 6 6 6 6 6 6 6 6 6 6 6 6 1 1 1 1 1 1 1 1 1 1 1 1 1 1 1 1 1 1 1 1 1 1
symmnumber: 1
zpe: 982389.1 jmol-1
zpe.correction: 0.374172 hartree
zpe.thermalcorrener: 0.400716 hartree
zpe.thermalcorrenthalpy: 0.401660 hartree
zpe.thermalcorrgfe: 0.313762 hartree
zpe.sumelectzpe: -2358.729638 hartree
zpe.sumelectthermal: -2358.703095 hartree
zpe.sumelectthermalent: -2358.702151 hartree
zpe.sumelectthermalfe: -2358.790049 hartree
dipole: -4.9846 2.0251 0.5047
dipole: 5.4038
quadrupole: -185.6721 -160.4013 -177.9164
quadrupole: 4.3200 1.8087 -0.2129
quadrupole: -11.0088 14.2620 -3.2532 4.3200 1.8087 -0.2129
hfenergy: -2359.1038104 hartree
pointgroup: C01 [X(C20H22Cl3N1O2)]
dipole: -1.9602771 0.7989193 0.1976736 debye
polarizability: 324.1755489|18.9386858|304.1684987|19.8312404|-12.5900207|164.0357568 unknown
InChI: InChI=1S/C20H22Cl3NO2/c1-24-7-6-13-10-18(25-2)19(26-3)11-14(13)17(24)5-4-12-8-15(21)20(23)16(22)9-12/h8-11,17H,4-7H2,1-3H3
charge 0 multiplicity 1
48 atoms
Cl 4.272272 -3.444443 0.007076
Cl 6.275167 1.786186 -0.28983
Cl 6.829645 -1.418177 -0.045793
O  -3.271818 -2.543966 1.314895
O  -4.785441 -1.907534 -1.119911
N  -0.795115 3.09903 0.325548
C  -0.882348 1.794582 1.04692
C  -1.927897 0.838575 0.455595
C  0.528195 1.12173 1.078953
C  -2.041037 3.533534 -0.347334
C  -2.459794 2.489872 -1.394475
C  -2.660468 1.143321 -0.722866
C  1.058652 0.775915 -0.337371
C  -2.15793 -0.400284 1.103446
C  -0.221555 4.168469 1.166746
C  -3.606892 0.212768 -1.214261
C  -3.081768 -1.336069 0.600421
C  -3.835363 -1.01596 -0.566304
C  2.475003 0.233436 -0.297234
C  3.586772 1.112308 -0.324443
C  2.717469 -1.158788 -0.195047
C  4.033716 -1.650938 -0.118305
C  4.897655 0.607256 -0.24612
C  5.148551 -0.781021 -0.141384
C  -2.929068 -3.768762 0.553728
C  -5.9505 -2.184599 -0.246244
H  -1.172744 1.973535 2.11541
H  0.481323 0.205731 1.698081
H  1.245113 1.79841 1.581906
H  -1.835018 4.503748 -0.836843
H  -2.881053 3.696918 0.375466
H  -1.665732 2.428041 -2.164685
H  -3.38866 2.809531 -1.902737
H  1.007441 1.699357 -0.943091
H  0.38039 0.036759 -0.802939
H  -1.618805 -0.670383 2.018483
H  0.760279 3.864632 1.568199
H  -0.874751 4.441207 2.033585
H  -0.066749 5.075703 0.556035
H  -4.201062 0.440392 -2.106353
H  3.433557 2.192315 -0.414026
H  1.880898 -1.864116 -0.17898
H  -3.183355 -4.608077 1.218754
H  -1.845847 -3.784234 0.327015
H  -3.508652 -3.826122 -0.385093
H  -6.535691 -1.258331 -0.090811
H  -5.626913 -2.590814 0.729115
H  -6.556773 -2.923544 -0.791998
