program: Gaussian 09
title: 000005376
version: EM64L-G09RevD.01
frameworkgroup: C1[X(C26H29NO)]
method: RPBEPBE
basis: SDD
operation: Freq
keyword: #p
keyword: freq=noraman
keyword: PBEPBE/SDD
title: #p freq=noraman PBEPBE/SDD
converged: YES YES NO NO
title: Mulliken charges:
elementType: O N C C C C C C C C C C C C C C C C C C C C C C C C C C H H H H H H H H H H H H H H H H H H H H H H H H H H H H H
charge: -0.268353 -0.095100 0.093269 0.173015 0.287318 -0.559280 0.281427 0.324231 -0.401952 -0.381259 -0.689518 0.337494 -0.355983 -0.397828 -0.401198 -0.403837 -0.418934 -0.387350 -0.380593 -0.285760 -0.230811 -0.232639 -0.242097 -0.230937 -0.252024 -0.249905 -0.613519 -0.613902 0.256305 0.211054 0.251142 0.244713 0.210901 0.216478 0.237226 0.248562 0.249321 0.254675 0.250782 0.224741 0.201772 0.227246 0.254018 0.224331 0.206209 0.224046 0.222629 0.222208 0.224734 0.225400 0.226120 0.220318 0.192473 0.226596 0.222374 0.190461 0.229189
chargesum: 0.00000
title: Mulliken charges with hydrogens summed into heavy atoms:
elementType: O N C C C C C C C C C C C C C C C C C C C C C C C C C C
charge: -0.268353 -0.095100 0.093269 0.173015 0.287318 -0.091920 0.281427 0.324231 -0.150810 -0.136546 -0.024914 0.337494 -0.107421 -0.148507 -0.146523 -0.153055 -0.191689 -0.133332 0.045920 0.144780 -0.006765 -0.010010 -0.019889 -0.006203 -0.026624 -0.023786 0.025868 0.028122
polarizability: 4.47512986e+02 6.44471168e+00 2.88333360e+02 1.73676049e+01 6.01792377e+00 2.09997547e+02
1716.lowfreq: -3.5768 -2.1986 -0.0006 0.0006 0.0010 4.6028 15.8286 22.4891 25.9076
frequency: 15.8253 22.4788 25.8838 41.8294 45.1386 49.9437 57.9781 63.8087 70.3280 81.4259 97.9237 102.1192 133.2713 143.0213 162.9728 175.1577 187.7187 203.2423 212.0613 221.4550 232.1544 254.4860 260.9053 294.2335 310.5015 319.5731 346.8677 367.8869 398.5607 403.2977 405.8876 417.2018 427.8356 436.6668 465.1705 497.9377 502.3715 521.7010 561.0859 593.5573 614.0456 615.5584 619.0445 634.2421 664.6996 683.7438 701.6617 703.7749 733.6674 755.8783 770.3409 779.3929 783.1435 811.2009 821.1074 828.6864 839.9958 847.4482 852.0928 853.3724 882.0088 917.9860 924.4699 947.3102 957.7337 968.4244 975.9902 977.9545 978.5201 988.0893 988.9403 992.9049 993.5537 1003.8936 1024.5226 1027.0837 1033.5373 1034.8512 1045.0139 1058.2827 1063.1514 1081.4133 1087.8587 1089.7926 1095.3588 1102.4423 1116.7971 1139.2349 1167.2829 1170.4632 1171.0535 1178.0972 1184.8865 1189.7570 1192.0449 1227.7473 1245.2220 1248.0905 1267.4040 1268.0306 1290.5061 1292.5313 1304.8866 1312.5771 1317.3975 1322.4088 1331.3776 1356.9309 1368.9299 1373.2249 1386.4372 1391.4837 1418.6979 1420.8208 1431.0604 1432.8767 1442.8003 1461.2593 1468.2338 1471.3603 1471.6080 1472.6979 1476.6763 1477.3032 1479.8873 1484.7635 1485.9274 1486.2222 1498.2318 1567.1474 1572.9462 1579.6010 1591.8836 1605.5826 1606.2918 1616.3606 2853.4841 2863.3419 2890.9323 2967.2678 2968.8729 2979.2928 3021.0952 3027.4259 3031.5628 3057.0494 3060.5403 3072.5914 3080.0155 3085.0889 3087.1513 3117.4962 3119.4315 3125.5451 3127.0754 3136.0424 3138.2270 3140.0177 3140.5601 3149.3311 3149.4370 3161.8019 3162.9006 3163.1059 3166.4100
redmass: 4.8053 2.5694 4.6088 3.9107 4.3507 3.8448 4.4875 3.9813 3.7620 3.8200 2.9956 3.3957 2.1804 3.4376 4.6878 3.4366 1.3034 3.0308 2.4448 1.0717 1.8087 3.5395 3.0654 4.2191 4.2794 3.3553 2.6977 3.3004 2.9154 2.8455 2.8467 2.9985 2.5262 3.4645 4.3335 3.7907 3.5186 3.1057 4.0723 4.0171 6.1339 5.8910 5.5159 6.3088 5.1942 4.6469 1.6811 1.6387 3.3072 2.9091 1.5057 2.3407 3.3917 1.3279 1.8620 1.5704 2.1704 1.8953 1.2974 1.2531 3.8512 1.4487 1.4465 1.5235 2.1012 1.4010 1.4126 1.4078 7.0990 5.7197 5.2630 1.3463 1.3228 2.7300 2.5634 2.1489 2.1737 1.5779 2.4124 1.7522 1.5948 1.6123 1.6600 1.4528 2.1471 1.9402 1.3348 1.4432 1.4251 1.0613 1.0680 1.9507 1.5548 1.1354 1.1441 2.8921 1.5567 1.8157 2.5280 2.5161 2.4198 1.2110 1.3917 1.3941 1.4104 1.5418 1.3764 4.5665 6.5118 6.1732 1.2053 1.4476 3.7395 1.1437 2.3309 2.2967 1.1630 1.0484 1.0627 1.1621 1.0679 1.0912 1.0797 1.8640 2.1284 1.1490 1.0920 1.0676 2.1207 7.2014 6.3932 5.8875 7.9358 6.0696 6.0778 6.3262 1.0567 1.0579 1.0689 1.0676 1.0563 1.0353 1.0731 1.0753 1.0968 1.0975 1.0916 1.1002 1.1007 1.1005 1.0987 1.0848 1.0844 1.0870 1.0875 1.0883 1.0926 1.0927 1.0876 1.0959 1.0954 1.0949 1.1013 1.1012 1.0965
irintensity: 0.2300 0.5442 0.0655 0.2202 0.5008 0.1115 0.0923 0.2351 0.1485 0.2602 0.0398 0.7392 3.1357 0.0674 0.4300 1.0997 0.2994 0.5168 0.4577 1.0023 1.4222 0.7840 0.9728 1.3018 0.8128 0.7653 8.9877 2.9350 0.8558 0.1195 0.0202 1.0575 1.0260 1.8023 3.6779 11.1566 7.2420 10.1337 10.5379 23.8128 1.4554 3.3729 5.0713 3.0334 6.5818 3.3377 63.5061 33.3042 3.9603 35.4963 70.4349 9.5052 14.0967 27.7532 19.1010 0.9925 3.2975 30.9868 1.8777 0.5770 4.1446 6.2533 2.5656 2.5754 5.1599 1.9265 1.6577 0.2011 113.3760 0.1337 0.3745 0.4585 0.4549 10.1976 11.9339 8.0048 65.9573 24.9681 3.8917 2.0530 5.2452 0.8435 15.4138 15.8040 7.0341 11.7083 10.8863 2.9971 17.9165 0.1308 0.8999 66.9813 69.9733 3.6641 1.1455 306.7085 1.5938 7.0765 14.5392 36.8123 5.3421 2.6327 3.0689 0.2383 0.8188 7.8189 3.7486 10.4401 3.6192 1.2738 14.8505 2.0435 2.1961 3.8931 1.5504 12.7958 5.4745 9.6557 5.1385 4.0991 8.6828 45.0425 10.3731 4.3768 10.5985 83.1828 9.6213 8.0397 123.7723 12.9978 2.2909 2.8711 2.6895 22.6112 11.8555 102.9920 69.2659 180.2987 110.8417 23.6433 38.3912 40.2325 39.4063 49.5219 11.2560 37.6718 4.3209 44.9658 33.1752 60.9916 46.3761 5.7809 2.5773 0.3540 1.7785 10.9270 26.1345 23.3021 10.0084 39.1212 33.1964 19.2795 27.5811 21.5522 5.5015
temp: 298.150 k
press: 1.00000 atm
elementType: 8 7 6 6 6 6 6 6 6 6 6 6 6 6 6 6 6 6 6 6 6 6 6 6 6 6 6 6 1 1 1 1 1 1 1 1 1 1 1 1 1 1 1 1 1 1 1 1 1 1 1 1 1 1 1 1 1
symmnumber: 1
zpe: 1251077.3 jmol-1
zpe.correction: 0.476510 hartree
zpe.thermalcorrener: 0.503823 hartree
zpe.thermalcorrenthalpy: 0.504768 hartree
zpe.thermalcorrgfe: 0.415786 hartree
zpe.sumelectzpe: -1136.075486 hartree
zpe.sumelectthermal: -1136.048173 hartree
zpe.sumelectthermalent: -1136.047229 hartree
zpe.sumelectthermalfe: -1136.136210 hartree
dipole: 1.8538 0.5945 -0.2019
dipole: 1.9573
quadrupole: -138.8613 -160.6172 -164.2220
quadrupole: 2.1237 4.1014 3.1770
quadrupole: 15.7055 -6.0504 -9.6552 2.1237 4.1014 3.1770
hfenergy: -1136.5519962 hartree
pointgroup: C01[X(C26H29N1O1)]
dipole: 0.7172813 -0.271449 0.0692376 debye
polarizability: 446.0918623|-14.1873214|289.2224568|-19.5242558|7.953051|210.5295745 unknown
InChI: InChI=1S/C26H29NO/c1-4-25(21-11-7-5-8-12-21)26(22-13-9-6-10-14-22)23-15-17-24(18-16-23)28-20-19-27(2)3/h5-18H,4,19-20H2,1-3H3
charge 0 multiplicity 1
57 atoms
O  4.371307 0.719071 -0.552716
N  7.752537 -0.528453 0.427136
C  -1.321515 0.162248 0.112141
C  -2.162491 1.24353 0.326004
C  0.163688 0.309714 -0.03344
C  -1.642539 2.643003 0.655496
C  -1.823178 -1.254327 0.060667
C  -3.655965 1.13188 0.241218
C  1.049818 -0.536501 0.684702
C  0.743235 1.257252 -0.926967
C  -1.989891 3.717966 -0.407466
C  2.999166 0.528936 -0.332916
C  2.450848 -0.431885 0.554112
C  2.135904 1.369709 -1.078758
C  -2.729675 -1.756449 1.034916
C  -1.353372 -2.149015 -0.941071
C  -4.501927 1.724033 1.220602
C  -4.275012 0.488248 -0.868038
C  6.7196 0.302846 -0.233737
C  5.311972 -0.135938 0.193054
C  -3.168986 -3.096561 0.995582
C  -1.799181 -3.48759 -0.98834
C  -5.908027 1.651106 1.112571
C  -5.678874 0.421537 -0.983129
C  -2.711385 -3.968902 -0.020064
C  -6.505764 0.999005 0.009306
C  7.939789 -1.844584 -0.218624
C  9.035633 0.180703 0.606518
H  -0.552736 2.614903 0.819394
H  -2.093142 2.961952 1.618483
H  0.633428 -1.287342 1.365307
H  0.087278 1.896669 -1.527099
H  -1.530584 3.479153 -1.384241
H  -1.620734 4.710836 -0.091008
H  -3.081472 3.789602 -0.559763
H  3.09529 -1.094437 1.139301
H  2.576443 2.091619 -1.773357
H  -3.083672 -1.088739 1.827371
H  -0.637788 -1.786296 -1.687988
H  6.858633 1.355077 0.072361
H  6.789451 0.274513 -1.348645
H  -4.059323 2.229315 2.087079
H  -3.642851 0.042786 -1.643378
H  5.185173 0.006418 1.283761
H  5.12307 -1.200136 -0.054097
H  -3.865478 -3.461665 1.759077
H  -1.433235 -4.155087 -1.777076
H  -6.536248 2.103416 1.888709
H  -6.128411 -0.078117 -1.848883
H  -3.054361 -5.009333 -0.051759
H  -7.596796 0.946374 -0.078554
H  6.980864 -2.387786 -0.276306
H  8.353953 -1.767336 -1.256366
H  8.634839 -2.456512 0.383492
H  9.728227 -0.452379 1.190188
H  9.540969 0.441104 -0.358034
H  8.871401 1.114845 1.171774
